Pyridine, 2-butyl-
- Formula: C9H13N
- Molecular weight: 135.2062
- IUPAC Standard InChIKey: ADSOSINJPNKUJK-UHFFFAOYSA-N
- CAS Registry Number: 5058-19-5
- Chemical structure:
View 3d structure (requires JavaScript / HTML 5) - Other names: 2-Butylpyridine

Reaction thermochemistry data

Data compiled by: Michael M. Meot-Ner (Mautner) and Sharon G. Lias
Individual Reactions
By formula: C9H14N+ + C9H13N = (C9H14N+ • C9H13N)
Quantity | Value | Units | Method | Reference | Comment |
---|---|---|---|---|---|
ΔrH° | 96.2 | kJ/mol | PHPMS | Meot-Ner M. and Sieck, 1983 | gas phase |
Quantity | Value | Units | Method | Reference | Comment |
ΔrS° | 165. | J/mol*K | PHPMS | Meot-Ner M. and Sieck, 1983 | gas phase |

Ion clustering data

Data compiled by: Michael M. Meot-Ner (Mautner) and Sharon G. Lias
Clustering reactions
By formula: C9H14N+ + C9H13N = (C9H14N+ • C9H13N)
Quantity | Value | Units | Method | Reference | Comment |
---|---|---|---|---|---|
ΔrH° | 96.2 | kJ/mol | PHPMS | Meot-Ner M. and Sieck, 1983 | gas phase |
Quantity | Value | Units | Method | Reference | Comment |
ΔrS° | 165. | J/mol*K | PHPMS | Meot-Ner M. and Sieck, 1983 | gas phase |

References

Meot-Ner M. and Sieck, 1983
Meot-Ner M.; Sieck, L.W.,
The Ionic Hydrogen Bond. 1. Sterically Hindered Bonds. Solvation and Clustering of Sterically Hindered Amines and Pyridines,
J. Am. Chem. Soc., 1983, 105, 10, 2956, https://doi.org/10.1021/ja00348a005
. [all data]