Octanedioic acid
- Formula: C8H14O4
- Molecular weight: 174.1944
- IUPAC Standard InChIKey: TYFQFVWCELRYAO-UHFFFAOYSA-N
- CAS Registry Number: 505-48-6
- Chemical structure:
View 3d structure (requires JavaScript / HTML 5) - Other names: Suberic acid; Hexamethylenedicarboxylic acid; 1,6-Hexanedicarboxylic acid; 1,8-Octanedioic acid; 1,6-Dicarboxyhexane; Cork acid; Octane-1,8-dioic acid

Condensed phase thermochemistry data

Data compiled by: Hussein Y. Afeefy, Joel F. Liebman, and Stephen E. Stein
Quantity | Value | Units | Method | Reference | Comment |
---|---|---|---|---|---|
ΔcH°solid | -982.53 ± 0.30 | kcal/mol | Ccb | Verkade, Hartman, et al., 1926 | Reanalyzed by Cox and Pilcher, 1970, Original value = -983.2 kcal/mol; See Verkade, Hartman, et al., 1924; Corresponding ΔfHºsolid = -248.08 kcal/mol (simple calculation by NIST; no Washburn corrections) |

Phase change data

Data compiled as indicated in comments:
BS - Robert L. Brown and Stephen E. Stein
TRC - Thermodynamics Research Center, NIST Boulder Laboratories, Chris Muzny director
AC - William E. Acree, Jr., James S. Chickos
ALS - Hussein Y. Afeefy, Joel F. Liebman, and Stephen E. Stein
DH - Eugene S. Domalski and Elizabeth D. Hearing
Quantity | Value | Units | Method | Reference | Comment |
---|---|---|---|---|---|
Tfus | 414. ± 5. | K | AVG | N/A | Average of 6 values; Individual data points |
Quantity | Value | Units | Method | Reference | Comment |
ΔvapH° | 27.9 ± 0.2 | kcal/mol | CGC | Roux, Temprado, et al., 2005 | Based on data from 424. to 503. K.; AC |
Quantity | Value | Units | Method | Reference | Comment |
ΔsubH° | 35.33 ± 0.91 | kcal/mol | N/A | Ribeiro da Silva, Monte, et al., 1999 | See also Davies and Thomas, 1960.; AC |
ΔsubH° | 34.2 ± 0.9 | kcal/mol | V | Davies and Thomas, 1960 | ALS |
Reduced pressure boiling point
Tboil (K) | Pressure (atm) | Reference | Comment |
---|---|---|---|
503.2 | 0.020 | Aldrich Chemical Company Inc., 1990 | BS |
Enthalpy of vaporization
ΔvapH (kcal/mol) | Temperature (K) | Method | Reference | Comment |
---|---|---|---|---|
21.8 | 460. | A | Stephenson and Malanowski, 1987 | Based on data from 445. to 619. K. See also Stull, 1947.; AC |
Antoine Equation Parameters
log10(P) = A − (B / (T + C))
P = vapor pressure (atm)
T = temperature (K)
View plot Requires a JavaScript / HTML 5 canvas capable browser.
Temperature (K) | A | B | C | Reference | Comment |
---|---|---|---|---|---|
446.0 to 618.7 | 7.33963 | 4491.928 | -6.551 | Stull, 1947 | Coefficents calculated by NIST from author's data. |
Enthalpy of sublimation
ΔsubH (kcal/mol) | Temperature (K) | Method | Reference | Comment |
---|---|---|---|---|
40. ± 2. | 348. to 378. | TPD | Cappa, Lovejoy, et al., 2007 | AC |
35.4 | 310. to 320. | TPTD | Chattopadhyay, Tobias, et al., 2001 | AC |
34.20 ± 0.91 | 393. | M | Davies and Thomas, 1960 | Based on data from 379. to 407. K. See also Cox and Pilcher, 1970, 2 and Stephenson and Malanowski, 1987.; AC |
Enthalpy of fusion
ΔfusH (kcal/mol) | Temperature (K) | Reference | Comment |
---|---|---|---|
7.34 | 413.2 | Roux, Temprado, et al., 2005 | AC |
6.888 | 415.3 | Acree, 1991 | AC |
Enthalpy of phase transition
ΔHtrs (kcal/mol) | Temperature (K) | Initial Phase | Final Phase | Reference | Comment |
---|---|---|---|---|---|
2.159 | 407.0 | crystaline, II | crystaline, I | Cingolani and Berchiesi, 1974 | DH |
6.9699 | 415.5 | crystaline, I | liquid | Cingolani and Berchiesi, 1974 | DH |
Entropy of phase transition
ΔStrs (cal/mol*K) | Temperature (K) | Initial Phase | Final Phase | Reference | Comment |
---|---|---|---|---|---|
5.311 | 407.0 | crystaline, II | crystaline, I | Cingolani and Berchiesi, 1974 | DH |
16.78 | 415.5 | crystaline, I | liquid | Cingolani and Berchiesi, 1974 | DH |

Reaction thermochemistry data

Data compiled by: John E. Bartmess
Individual Reactions
C8H13O4- + =
By formula: C8H13O4- + H+ = C8H14O4
Quantity | Value | Units | Method | Reference | Comment |
---|---|---|---|---|---|
ΔrH° | 324.0 ± 2.0 | kcal/mol | CIDC | Kumar, Prabhakar, et al., 2005 | gas phase |
Quantity | Value | Units | Method | Reference | Comment |
ΔrG° | 322.4 ± 2.0 | kcal/mol | CIDC | Kumar, Prabhakar, et al., 2005 | gas phase |

Gas phase ion energetics data

Data compiled by: John E. Bartmess
De-protonation reactions
C8H13O4- + =
By formula: C8H13O4- + H+ = C8H14O4
Quantity | Value | Units | Method | Reference | Comment |
---|---|---|---|---|---|
ΔrH° | 324.0 ± 2.0 | kcal/mol | CIDC | Kumar, Prabhakar, et al., 2005 | gas phase |
Quantity | Value | Units | Method | Reference | Comment |
ΔrG° | 322.4 ± 2.0 | kcal/mol | CIDC | Kumar, Prabhakar, et al., 2005 | gas phase |

References

Verkade, Hartman, et al., 1926
Verkade, P.E.; Hartman, H.; Coops, J.,
Calorimetric researches. X. Heats of combustion of successive terms of homologous series: dicarboxylic acids of the oxalic acid series,
Rec. Trav. Chim. Pays/Bas, 1926, 45, 373-393. [all data]
Cox and Pilcher, 1970
Cox, J.D.; Pilcher, G.,
Thermochemistry of Organic and Organometallic Compounds, Academic Press, New York, 1970, 1-636. [all data]
Verkade, Hartman, et al., 1924
Verkade, P.E.; Hartman, H.; Coops, J., Jr.,
Chemistry - The molecular heat of combustion of successive terms of homologous series,
Kom. Med. Akad. Ueknschap. Proc., 1924, 27, 859-866. [all data]
Roux, Temprado, et al., 2005
Roux, Maria Victoria; Temprado, Manuel; Chickos, James S.,
Vaporization, fusion and sublimation enthalpies of the dicarboxylic acids from C4 to C14 and C16,
The Journal of Chemical Thermodynamics, 2005, 37, 9, 941-953, https://doi.org/10.1016/j.jct.2004.12.011
. [all data]
Ribeiro da Silva, Monte, et al., 1999
Ribeiro da Silva, Manuel A.V.; Monte, Manuel J.S.; Ribeiro, José R.,
Vapour pressures and the enthalpies and entropies of sublimation of five dicarboxylic acids,
The Journal of Chemical Thermodynamics, 1999, 31, 8, 1093-1107, https://doi.org/10.1006/jcht.1999.0522
. [all data]
Davies and Thomas, 1960
Davies, M.; Thomas, G.H.,
The lattice energies, infra-red spectra, and possible cyclization of some dicarboxylic acids,
Trans. Faraday Soc., 1960, 56, 185. [all data]
Aldrich Chemical Company Inc., 1990
Aldrich Chemical Company Inc.,
Catalog Handbook of Fine Chemicals, Aldrich Chemical Company, Inc., Milwaukee WI, 1990, 1. [all data]
Stephenson and Malanowski, 1987
Stephenson, Richard M.; Malanowski, Stanislaw,
Handbook of the Thermodynamics of Organic Compounds, 1987, https://doi.org/10.1007/978-94-009-3173-2
. [all data]
Stull, 1947
Stull, Daniel R.,
Vapor Pressure of Pure Substances. Organic and Inorganic Compounds,
Ind. Eng. Chem., 1947, 39, 4, 517-540, https://doi.org/10.1021/ie50448a022
. [all data]
Cappa, Lovejoy, et al., 2007
Cappa, Christopher D.; Lovejoy, Edward R.; Ravishankara, A.R.,
Determination of Evaporation Rates and Vapor Pressures of Very Low Volatility Compounds: A Study of the C 4 -C 10 and C 12 Dicarboxylic Acids,
J. Phys. Chem. A, 2007, 111, 16, 3099-3109, https://doi.org/10.1021/jp068686q
. [all data]
Chattopadhyay, Tobias, et al., 2001
Chattopadhyay, Sulekha; Tobias, Herbert J.; Ziemann, Paul J.,
A Method for Measuring Vapor Pressures of Low-Volatility Organic Aerosol Compounds Using a Thermal Desorption Particle Beam Mass Spectrometer,
Anal. Chem., 2001, 73, 16, 3797-3803, https://doi.org/10.1021/ac010304j
. [all data]
Cox and Pilcher, 1970, 2
Cox, J.D.; Pilcher, G.,
Thermochemistry of Organic and Organometallic Compounds, Academic Press Inc., London, 1970, 643. [all data]
Acree, 1991
Acree, William E.,
Thermodynamic properties of organic compounds: enthalpy of fusion and melting point temperature compilation,
Thermochimica Acta, 1991, 189, 1, 37-56, https://doi.org/10.1016/0040-6031(91)87098-H
. [all data]
Cingolani and Berchiesi, 1974
Cingolani, A.; Berchiesi, G.,
Thermodynamic properties of organic compounds. 1. A DSC study of phase transitions in aliphatic dicarboxylic acids,
J. Therm. Anal., 1974, 6, 87-90. [all data]
Kumar, Prabhakar, et al., 2005
Kumar, M.R.; Prabhakar, S.; Nagaveni, V.; Vairamani, M.,
Estimation of gas-phase acidities of a series of dicarboxylic acids by the kinetic method,
Rapid Commun. Mass Spectrom., 2005, 19, 8, 1053-1057, https://doi.org/10.1002/rcm.1888
. [all data]