3-methylbutane-1,2-diol
- Formula: C5H12O2
- Molecular weight: 104.1476
- IUPAC Standard InChIKey: HJJZIMFAIMUSBW-UHFFFAOYSA-N
- CAS Registry Number: 50468-22-9
- Chemical structure:
View 3d structure (requires JavaScript / HTML 5) - Stereoisomers:
- Other names: 1,2-butanediol, 3-methyl-

Phase change data

Data compiled by: Thermodynamics Research Center, NIST Boulder Laboratories, Chris Muzny director
Quantity | Value | Units | Method | Reference | Comment |
---|---|---|---|---|---|
Tboil | 461.15 | K | N/A | Milas and Sussman, 1937 | Uncertainty assigned by TRC = 2. K |
Tboil | 473.02 | K | N/A | Wagner, 1888 | Uncertainty assigned by TRC = 3. K |

References

Milas and Sussman, 1937
Milas, N.A.; Sussman, S.,
The Hydroxylation of Unsaturated Substances. IV. The Catalytic Hydroxylation of Unsaturated Hydrocarbons,
J. Am. Chem. Soc., 1937, 59, 2345. [all data]
Wagner, 1888
Wagner, G.,
Chem. Ber., 1888, 21, 1230. [all data]