Hexadecane, 2,6,11,15-tetramethyl-
- Formula: C20H42
- Molecular weight: 282.5475
- IUPAC Standard InChIKey: KKFZXXATNGJPJS-UHFFFAOYSA-N
- CAS Registry Number: 504-44-9
- Chemical structure:
View 3d structure (requires JavaScript / HTML 5) - Other names: Crocetane; 2,6,11,15-Tetramethylhexadecane

Phase change data

Data compiled by: Thermodynamics Research Center, NIST Boulder Laboratories, Chris Muzny director
Quantity | Value | Units | Method | Reference | Comment |
---|---|---|---|---|---|
Tboil | 592.0 | K | N/A | Anonymous, 1962 | Uncertainty assigned by TRC = 0.6 K |

Kovats' RI, non-polar column, custom temperature program

Column type | Active phase | I | Reference | Comment |
---|---|---|---|---|
Capillary | Apiezon L | 1792. | Shlyakhov, 1984 | Program: not specified |

Normal alkane RI, non-polar column, custom temperature program

Column type | Active phase | I | Reference | Comment |
---|---|---|---|---|
Capillary | DB-1 | 1813. | Elvert, Suess, et al., 2000 | 30. m/0.25 mm/0.25 μm, He; Program: 60C(1min) => 10C/min => 140C => 5C/min => 310C (25min) |
Capillary | Squalane | 1792. | Petrov, 1984 | Program: not specified |

References

Anonymous, 1962
Anonymous, R.,
, Am. Pet. Inst. Res. Proj. 58A, Annu. Rep., 1962. [all data]
Shlyakhov, 1984
Shlyakhov, A.F.,
Gas chromatography in organic geochemistry, Nedra, Moscow, 1984, 221. [all data]
Elvert, Suess, et al., 2000
Elvert, M.; Suess, E.; Greinert, J.; Whiticar, M.J.,
Archaea mediating anaerobic methane oxidation in deep-sea sediments at cold seeps of the eastern Aleutian subduction zone,
Org. Geochem., 2000, 31, 11, 1175-1187, https://doi.org/10.1016/S0146-6380(00)00111-X
. [all data]
Petrov, 1984
Petrov, A.A.,
Hydrocarbons of petroleum, Nauka (publishing house), Moscow, 1984, 263. [all data]