11-Ketoetiocholanolone, TMS derivative
- Formula: C22H36O3Si
- Molecular weight: 376.6049
- IUPAC Standard InChIKey: CCJDJZHCDREQKR-ZFYAARLPSA-N
- CAS Registry Number: 5042-90-0
- Chemical structure:
View 3d structure (requires JavaScript / HTML 5) - Other names: Androstane-11,17-dione, 3-[(trimethylsilyl)oxy]-, (3α,5β)-; 5β-Androstane-11,17-dione, 3α-(trimethylsiloxy)-; 3-[(Trimethylsilyl)oxy]androstane-11,17-dione-, (3α,5β)-; 11-Ketoetiocholanolone TMS; 11-Ketoandrosterone (5A-Androstan-3A-ol-11,17-dione), TMS

Van Den Dool and Kratz RI, non-polar column, temperature ramp

Column type | Active phase | I | Reference | Comment |
---|---|---|---|---|
Capillary | DB-1 | 2622. | Ludwig-Koehn and Henning, 1986 | 30. m/0.25 mm/0.25 μm, H2, 2. K/min; Tstart: 120. C; Tend: 280. C |

Normal alkane RI, non-polar column, custom temperature program

Column type | Active phase | I | Reference | Comment |
---|---|---|---|---|
Capillary | DB-1 | 2611. | Bowers, 1996 | 30. m/0.25 mm/0.25 μm, Helium; Program: 170 0C 20 0C/min -> 260 0C 2.7 0C/min -> 305 0C 20 0C/min -> 320 0C |

References

Ludwig-Koehn and Henning, 1986
Ludwig-Koehn, H.; Henning, H.V.,
Some aspects of quantification of neutral steroid metabolites in body fluids of healthy and uremic subjects by capillary gas chromatography,
J. Hi. Res. Chromatogr. Chromatogr. Comm., 1986, 9, 1, 35-38, https://doi.org/10.1002/jhrc.1240090106
. [all data]
Bowers, 1996
Bowers, L.D.,
Separation and confirmation of anabolic steroids with quadrupole ion trap tandem mass spectrometry,
J. Chromatogr. B, 1996, 687, 1, 69-78, https://doi.org/10.1016/S0378-4347(96)00231-9
. [all data]