Phorone
- Formula: C9H14O
- Molecular weight: 138.2069
- IUPAC Standard InChIKey: MTZWHHIREPJPTG-UHFFFAOYSA-N
- CAS Registry Number: 504-20-1
- Chemical structure:
View 3d structure (requires JavaScript / HTML 5) - Other names: 2,5-Heptadien-4-one, 2,6-dimethyl-; s-Diisopropylidene acetone; Diisobutenyl ketone; Diisopropylidene acetone; Foron; sym-Diisopropylidene acetone; Phoron; 2,6-Dimethyl-2,5-heptadien-4-one; NSC 38718; 2,6-dimethylhepta-2,5-dien-4-one

Phase change data

Data compiled as indicated in comments:
BS - Robert L. Brown and Stephen E. Stein
TRC - Thermodynamics Research Center, NIST Boulder Laboratories, Chris Muzny director
AC - William E. Acree, Jr., James S. Chickos
Quantity | Value | Units | Method | Reference | Comment |
---|---|---|---|---|---|
Tboil | 470.7 | K | N/A | Weast and Grasselli, 1989 | BS |
Tboil | 470.15 | K | N/A | Sabatier and Mailhe, 1909 | Uncertainty assigned by TRC = 2. K; TRC |
Quantity | Value | Units | Method | Reference | Comment |
Tfus | 299. | K | N/A | Babich, Hwang, et al., 1992 | Crystal phase 1 phase; Uncertainty assigned by TRC = 0.5 K; TRC |
Tfus | 301.15 | K | N/A | Sabatier and Mailhe, 1909 | Uncertainty assigned by TRC = 2. K; TRC |
Enthalpy of vaporization
ΔvapH (kJ/mol) | Temperature (K) | Method | Reference | Comment |
---|---|---|---|---|
54.1 | 330. | A | Stephenson and Malanowski, 1987 | Based on data from 315. to 471. K. See also Stull, 1947.; AC |
Antoine Equation Parameters
log10(P) = A − (B / (T + C))
P = vapor pressure (bar)
T = temperature (K)
View plot Requires a JavaScript / HTML 5 canvas capable browser.
Temperature (K) | A | B | C | Reference | Comment |
---|---|---|---|---|---|
315. to 470.4 | 5.1950 | 2259.288 | -35.106 | Stull, 1947 | Coefficents calculated by NIST from author's data. |

Van Den Dool and Kratz RI, polar column, temperature ramp

Column type | Active phase | I | Reference | Comment |
---|---|---|---|---|
Capillary | DB-Wax | 1564. | Shimoda, Shigematsu, et al., 1995 | 60. m/0.25 mm/0.25 μm, 2. K/min; Tstart: 50. C; Tend: 230. C |

Normal alkane RI, non-polar column, isothermal

Column type | Active phase | Temperature (C) | I | Reference | Comment |
---|---|---|---|---|---|
Packed | DC-400 | 150. | 1092. | Anderson, 1968 | Helium, Gas-Pak (60-80 mesh); Column length: 3.0 m |

References

Weast and Grasselli, 1989
CRC Handbook of Data on Organic Compounds, 2nd Editon, Weast,R.C and Grasselli, J.G., ed(s)., CRC Press, Inc., Boca Raton, FL, 1989, 1. [all data]
Sabatier and Mailhe, 1909
Sabatier, P.; Mailhe, A.,
New Applications of the General Method of Hydrogenation with Various Metals,
Ann. Chim. Phys., 1909, 16, 70. [all data]
Babich, Hwang, et al., 1992
Babich, M.W.; Hwang, S.W.; Mounts, R.D.,
Thermochim. Acta, 1992, 210, 77. [all data]
Stephenson and Malanowski, 1987
Stephenson, Richard M.; Malanowski, Stanislaw,
Handbook of the Thermodynamics of Organic Compounds, 1987, https://doi.org/10.1007/978-94-009-3173-2
. [all data]
Stull, 1947
Stull, Daniel R.,
Vapor Pressure of Pure Substances. Organic and Inorganic Compounds,
Ind. Eng. Chem., 1947, 39, 4, 517-540, https://doi.org/10.1021/ie50448a022
. [all data]
Shimoda, Shigematsu, et al., 1995
Shimoda, M.; Shigematsu, H.; Shiratsuchi, H.; Osajima, Y.,
Comparison of the odor concentrates by SDE and adsorptive column method from green tea infusion,
J. Agric. Food Chem., 1995, 43, 6, 1616-1620, https://doi.org/10.1021/jf00054a037
. [all data]
Anderson, 1968
Anderson, D.G.,
USe of Kovats retention indices and response factors for the qualitative and quantitative analysis of coating solvents,
J. Paint Technol., 1968, 40, 527, 549-557. [all data]