Cyanuric acid
- Formula: C3H3N3O3
- Molecular weight: 129.0742
- IUPAC Standard InChIKey: ZFSLODLOARCGLH-UHFFFAOYSA-N
- CAS Registry Number: 504-19-8
- Chemical structure:
View 3d structure (requires JavaScript / HTML 5) - Species with the same structure:
- Other names: 1,3,5-Triazine-2,4,6(1H,3H,5H)-trione; s-Triazine-2,4,6(1H,3H,5H)-trione; s-Triazine-2,4,6-triol; s-Triazinetriol; Isocyanuric acid; Pseudocyanuric acid; Tricyanic acid; Trihydroxycyanidine; 2,4,6-Trihydroxy-1,3,5-triazine; 1,3,5-Triazine-2,4,6-triol; s-2,4,6-Triazinetriol; sym-Triazinetriol; Kyselina kyanurova; 2,4,6-Trihydroxytriazine; 2,4,6-Trihydroxy-S-triazine; 2,4,6-Trioxohexahydro-1,3,5-triazine; 5-Azabarbituric acid; 2,4,6-Triazinetrione; Isocyanurate acid; s-Triazine-2,4,6-trione; s-Triazinetrione; Tricarbimide; NSC 6284

Gas phase thermochemistry data

Data compiled by: Hussein Y. Afeefy, Joel F. Liebman, and Stephen E. Stein
Quantity | Value | Units | Method | Reference | Comment |
---|---|---|---|---|---|
ΔfH°gas | -564.1 ± 1.5 | kJ/mol | Ccb | Kozyro, Kabo, et al., 1992 |

Phase change data

Data compiled by: Hussein Y. Afeefy, Joel F. Liebman, and Stephen E. Stein
Enthalpy of sublimation
ΔsubH (kJ/mol) | Temperature (K) | Method | Reference |
---|---|---|---|
139.5 | 470. | V | Kozyro, Kabo, et al., 1992 |

Reaction thermochemistry data

Data compiled by: Hussein Y. Afeefy, Joel F. Liebman, and Stephen E. Stein
Individual Reactions
By formula: C3Cl3N3 + 3H2O = C3H3N3O3 + 3HCl
Quantity | Value | Units | Method | Reference | Comment |
---|---|---|---|---|---|
ΔrH° | -399.1 ± 0.2 | kJ/mol | Cm | Humphries and Nicholson, 1957 | solid phase |

Condensed phase thermochemistry data

Data compiled by: Hussein Y. Afeefy, Joel F. Liebman, and Stephen E. Stein
Quantity | Value | Units | Method | Reference | Comment |
---|---|---|---|---|---|
ΔfH°solid | -703.5 ± 1.5 | kJ/mol | Ccb | Kozyro, Kabo, et al., 1992 | |
Quantity | Value | Units | Method | Reference | Comment |
ΔcH°solid | -905.8 ± 1.5 | kJ/mol | Ccb | Kozyro, Kabo, et al., 1992 |

References

Kozyro, Kabo, et al., 1992
Kozyro, A.A.; Kabo, G.Ya.; Soldatova, T.V.; Simirskii, V.V.; Gogolinskii, V.I.; Krasulin, A.P.; Dudarevich, N.M.,
Thermodynamic properties of cyanuric acid,
Russ. J. Phys. Chem. (Engl. Transl.), 1992, 66, 1374-1377. [all data]
Humphries and Nicholson, 1957
Humphries, A.R.; Nicholson, G.R.,
472. The heat of formation of cyanuric chloride and the heat of trimerisation of cyanogen chloride,
J. Chem. Phys., 1957, 2429-2431. [all data]