Nanofin
- Formula: C7H15N
- Molecular weight: 113.2007
- IUPAC Standard InChIKey: SDGKUVSVPIIUCF-UHFFFAOYSA-N
- CAS Registry Number: 504-03-0
- Chemical structure:
View 3d structure (requires JavaScript / HTML 5) - Stereoisomers:
- Other names: Piperidine, 2,6-dimethyl-; 2,6-Lupetidine; Lupetidin; Lupetidine; Naniopinum; Nanophin; Nanophine; Nanophyn; 2,6-Dimethylpiperidine; NSC 63890

Phase change data

Data compiled by: Thermodynamics Research Center, NIST Boulder Laboratories, Chris Muzny director
Quantity | Value | Units | Method | Reference | Comment |
---|---|---|---|---|---|
Tboil | 400.45 | K | N/A | Lanum and Morris, 1969 | Uncertainty assigned by TRC = 0.3 K |
Tboil | 401. | K | N/A | Terry, Kepner, et al., 1960 | Uncertainty assigned by TRC = 0.7 K |
Quantity | Value | Units | Method | Reference | Comment |
Tfus | 209.55 | K | N/A | Lanum and Morris, 1969 | Uncertainty assigned by TRC = 0.3 K |

Kovats' RI, non-polar column, isothermal

Column type | Active phase | Temperature (C) | I | Reference | Comment |
---|---|---|---|---|---|
Capillary | OV-101 | 110. | 834. | Zhuravleva, Golovnya, et al., 1993 | 50. m/0.30 mm/0.40 μm, He |
Packed | OV-101 | 120. | 873. | Litvinenko, Isakova, et al., 1988 | He, Chromaton W AW; Column length: 2.4 m |

Kovats' RI, polar column, isothermal

Column type | Active phase | Temperature (C) | I | Reference | Comment |
---|---|---|---|---|---|
Capillary | PEG-40M | 110. | 1016. | Zhuravleva, Golovnya, et al., 1993 | 50. m/0.30 mm/0.40 μm, He |

Normal alkane RI, non-polar column, custom temperature program

Column type | Active phase | I | Reference | Comment |
---|---|---|---|---|
Capillary | Methyl Silicone | 833. | Farkas, Héberger, et al., 2004 | Program: not specified |

Normal alkane RI, polar column, custom temperature program

Column type | Active phase | I | Reference | Comment |
---|---|---|---|---|
Capillary | DB-Wax | 1009. | Peng, Yang, et al., 1991 | Program: not specified |

References

Lanum and Morris, 1969
Lanum, W.J.; Morris, J.C.,
Physical Properties of Some Sulfur and Nitrogen Compounds,
J. Chem. Eng. Data, 1969, 14, 93-8. [all data]
Terry, Kepner, et al., 1960
Terry, T.D.; Kepner, R.E.; Dinsmore, W.,
Binary Systems Containing Isoamyl Alcohol or Active Amyl Alcohol,
J. Chem. Eng. Data, 1960, 5, 403. [all data]
Zhuravleva, Golovnya, et al., 1993
Zhuravleva, I.L.; Golovnya, R.V.; Kuzmenko, T.E.,
The regularities of the gas-chromatographic behavior of methyl-substituted N-alkylpiperidines,
Russ. Chem. Bull. (Engl. Transl.), 1993, 42, 10, 1677-1679, https://doi.org/10.1007/BF00697038
. [all data]
Litvinenko, Isakova, et al., 1988
Litvinenko, G.S.; Isakova, L.A.; Rubanyk, N.N.,
Quantitative correlation between structure of stereoisomeric saturated cyclic compounds and gas-chromatographic retention indices. I. Methysubstituted,
Izv. AN Kaz. SSR, Ser. Khim., 1988, 5, 54-66. [all data]
Farkas, Héberger, et al., 2004
Farkas, O.; Héberger, K.; Zenkevich, I.G.,
Quantitative structure-retention relationships. XIV. Prediction of gas chromatographic retention indices for saturated O-, N-, and S-heterocyclic compounds,
Chemom. Intell. Lab. Syst., 2004, 72, 2, 173-184, https://doi.org/10.1016/j.chemolab.2004.01.012
. [all data]
Peng, Yang, et al., 1991
Peng, C.T.; Yang, Z.C.; Ding, S.F.,
Prediction of rentention idexes. II. Structure-retention index relationship on polar columns,
J. Chromatogr., 1991, 586, 1, 85-112, https://doi.org/10.1016/0021-9673(91)80028-F
. [all data]