dl-Isopulegol
- Formula: C10H18O
- Molecular weight: 154.2493
- IUPAC Standard InChIKey: ZYTMANIQRDEHIO-UHFFFAOYSA-N
- CAS Registry Number: 50373-36-9
- Chemical structure:
View 3d structure (requires JavaScript / HTML 5) - Species with the same structure:
- Stereoisomers:
- Other names: Cyclohexanol, 5-methyl-2-(1-methylethenyl)-, (1α,2β,5α)-(.+/-.)-; Isopulegol, (.+/-.)-; 2-Isopropenyl-5-methylcyclohexanol, (1α,2β,5α)-; Cyclohexanol, 5-methyl-2-(1-methylethenyl)-, (1R,2S,5R)-rel-; iso-Isopulegol; (±)-(1α,2β,5α)-5-methyl-2-(1-methylvinyl)cyclohexan-1-ol; dl-isopulgeol

Phase change data

Data compiled by: Thermodynamics Research Center, NIST Boulder Laboratories, Chris Muzny director
Quantity | Value | Units | Method | Reference | Comment |
---|---|---|---|---|---|
Tboil | 485.15 | K | N/A | Kobe, Okabe, et al., 1941 | Uncertainty assigned by TRC = 1. K |

Normal alkane RI, non-polar column, temperature ramp

Column type | Active phase | I | Reference | Comment |
---|---|---|---|---|
Capillary | Optima-5 | 1159. | Al-Qudah, Muhaidat, et al., 2012 | 30. m/0.25 mm/0.25 μm, Helium, 60. C @ 1. min, 3. K/min; Tend: 246. C |
Capillary | DB-5 | 1167. | Mosayebi, Amin, et al., 2008 | 60. m/0.25 mm/0.25 μm, Nitrogen, 5. K/min, 250. C @ 10. min; Tstart: 60. C |

Normal alkane RI, polar column, custom temperature program

Column type | Active phase | I | Reference | Comment |
---|---|---|---|---|
Capillary | Innowax FSC | 1606. | Demirci, Temel, et al., 2011 | 60. m/0.25 mm/0.25 μm, Helium; Program: 60 0C (10 min) 4 0C/min -> 220 0C (10 min) 1 0C/min -> 240 0C |

References

Kobe, Okabe, et al., 1941
Kobe, K.A.; Okabe, T.S.; Ramstad, M.T.; Huemmer, P.M.,
p-Cymene Studies. VI. Vapor Pressure of p-Cymene, Some of its Derivatives and Related Compounds,
J. Am. Chem. Soc., 1941, 63, 3251. [all data]
Al-Qudah, Muhaidat, et al., 2012
Al-Qudah, M.A.; Muhaidat, R.; Trawenh, I.N.; Jaber, H.I.; Abu Zarga, M.H.; Abu Orabi, S.T.,
Volatile constituents of leaves and bulbs of Gynandriris Sisyrinchicum and their antimicrobial activities,
Jordan J. Chem., 2012, 7, 3, 287-295. [all data]
Mosayebi, Amin, et al., 2008
Mosayebi, M.; Amin, G.; Arzani, H.; Azarnivand, H.; Maleki, M.; Shafaghat, A.,
Effect of habitat on essential oil of Achillea filipendula L. in Iran,
Asian J. Plant Sci., 2008, 7, 8, 779-781, https://doi.org/10.3923/ajps.2008.779.781
. [all data]
Demirci, Temel, et al., 2011
Demirci, B.; Temel, H.E.; Portakai, T.; Kirmizibekmez, H.; Demirci, F.; Baser, K.H.C.,
Inhibitory effect of Calamintha neleta subsp. glandulosa essential oil on lipoxygenase,
Turk. J. Biochem., 2011, 36, 4, 290-295. [all data]