Cocaine

Phase change data

Data compiled by: William E. Acree, Jr., James S. Chickos

Enthalpy of sublimation

ΔsubH (kJ/mol) Temperature (K) Method Reference Comment
112.3 ± 2.8304.GSLawrence, Elias, et al., 1984Based on data from 294. - 314. K.

References

Lawrence, Elias, et al., 1984
Lawrence, A.H.; Elias, L.; Authier-Martin, M., Determination of amphetamine, cocaine, and heroin vapour pressures using a dynamic gas blending system and gas chromatographic analysis, Can. J. Chem., 1984, 62, 10, 1886-1888, https://doi.org/10.1139/v84-323 . [all data]