(trans-2-chlorovinyl)dichloroarsine
- Formula: C2H2AsCl3
- Molecular weight: 207.318
- IUPAC Standard InChIKey: GIKLTQKNOXNBNY-OWOJBTEDSA-N
- CAS Registry Number: 50361-05-2
- Chemical structure:
View 3d structure (requires JavaScript / HTML 5) - Species with the same structure:

Phase change data

Data compiled by: William E. Acree, Jr., James S. Chickos
Enthalpy of vaporization
ΔvapH (kJ/mol) | Temperature (K) | Reference | Comment |
---|---|---|---|
54.5 | 338. | Matthews, Sumner, et al., 1950 | Based on data from 323. to 423. K. |

References

Matthews, Sumner, et al., 1950
Matthews, J.B.; Sumner, J.F.; Moelwyn-Hughes, E.A.,
The vapour pressures of certain liquids,
Trans. Faraday Soc., 1950, 46, 797, https://doi.org/10.1039/tf9504600797
. [all data]