Cyclohexene, 1,5,5-trimethyl-
- Formula: C9H16
- Molecular weight: 124.2233
- IUPAC Standard InChIKey: CHOOCIQDWNAXQQ-UHFFFAOYSA-N
- CAS Registry Number: 503-46-8
- Chemical structure:
View 3d structure (requires JavaScript / HTML 5) - Species with the same structure:
- Other names: 1,5,5-trimethylcyclohexene

Condensed phase thermochemistry data

Data compiled by: Hussein Y. Afeefy, Joel F. Liebman, and Stephen E. Stein
Quantity | Value | Units | Method | Reference | Comment |
---|---|---|---|---|---|
ΔcH°liquid | -5595.7 | kJ/mol | Ccb | Roth-Greifswald, 1911 | Heat of combustion corrected for pressure; Corresponding ΔfHºliquid = -233. kJ/mol (simple calculation by NIST; no Washburn corrections) |

Normal alkane RI, non-polar column, custom temperature program

Column type | Active phase | I | Reference | Comment |
---|---|---|---|---|
Capillary | Polydimethyl siloxanes | 884. | Zenkevich, Chupalov, et al., 1996 | Program: not specified |

References

Roth-Greifswald, 1911
Roth-Greifswald, W.A.,
XVIII. Hauptversammlung der Deutschen Bunsen-Gesellschaft fur angewandte physikalische Chemie,
Z. Electrochem., 1911, 17, 789-840. [all data]
Zenkevich, Chupalov, et al., 1996
Zenkevich, I.G.; Chupalov, A.A.; Herzschuh, R.,
Correlation of the Increments of Gas Chromatographic Retention Indices with the Differences of Innermolecular Energies of Reagents and Products of Chemical Reactions,
Zh. Org. Khim. (Rus.), 1996, 32, 11, 1685-1691. [all data]