Cyclohexene, 3,3,5-trimethyl-
- Formula: C9H16
- Molecular weight: 124.2233
- IUPAC Standard InChIKey: GQVLBFQEABXQDC-UHFFFAOYSA-N
- CAS Registry Number: 503-45-7
- Chemical structure:
View 3d structure (requires JavaScript / HTML 5) - Other names: ε-Cyclogeraniolene; 3,3,5-Trimethylcyclohexene; 3,5,5-Trimethyl-1-cyclohexene; 3,3,5-Trimethyl-1-cyclohexene

Phase change data

Data compiled by: Thermodynamics Research Center, NIST Boulder Laboratories, Chris Muzny director
Quantity | Value | Units | Method | Reference | Comment |
---|---|---|---|---|---|
Tboil | 404.44 | K | N/A | Anonymous, 1951 | Uncertainty assigned by TRC = 0.2 K |
Tboil | 404.48 | K | N/A | Boord, Greenlee, et al., 1950 | Uncertainty assigned by TRC = 0.2 K |
Quantity | Value | Units | Method | Reference | Comment |
Tfus | 187.91 | K | N/A | Anonymous, 1951 | Uncertainty assigned by TRC = 0.3 K |
Tfus | 187.72 | K | N/A | Slomp, 1951 | Uncertainty assigned by TRC = 0.3 K |
Tfus | 187.76 | K | N/A | Boord, Greenlee, et al., 1950 | Uncertainty assigned by TRC = 0.3 K |

Normal alkane RI, polar column, custom temperature program

Column type | Active phase | I | Reference | Comment |
---|---|---|---|---|
Capillary | DB-Wax | 1633. | Kim. J.H., Ahn, et al., 2004 | 60. m/0.25 mm/0.25 μm, Helium; Program: 60 0C (3 min) 2 0C/min -> 150 0C 4 0C/min -> 200 0C |

References

Anonymous, 1951
Anonymous, R.,
, Sunbury Rep. No. 4199, Anglo-Iranian Oil Co., 1951. [all data]
Boord, Greenlee, et al., 1950
Boord, C.E.; Greenlee, K.W.; Derfer, J.M.,
The Synthesis, Purification and Prop. of Hydrocarbons of Low Mol. Wt., Am. Pet. Inst. Res. Proj. 45, Twelfth Annu. Rep., Ohio State Univ., 1950. [all data]
Slomp, 1951
Slomp, G.,
, Ph.D. Thesis, Ohio State Univ., Columbus, OH, 1951. [all data]
Kim. J.H., Ahn, et al., 2004
Kim. J.H.; Ahn, H.J.; Yook, H.S.; Kim, K.S.; Rhee, M.S.; Ryu, G.H.; Byun, M.W.,
Color, flavor, and sensory characteristics of gamma-irradiated salted and fermented anchovy sauce,
Radiation Phys. Chem., 2004, 69, 2, 179-187, https://doi.org/10.1016/S0969-806X(03)00400-6
. [all data]