Butane, 2,2-dibromo-
- Formula: C4H8Br2
- Molecular weight: 215.914
- IUPAC Standard InChIKey: XWDSASBQVXXTNE-UHFFFAOYSA-N
- CAS Registry Number: 50341-35-0
- Chemical structure:
View 3d structure (requires JavaScript / HTML 5) - Other names: 2,2-Dibromobutane

Gas phase thermochemistry data

Data compiled by: Hussein Y. Afeefy, Joel F. Liebman, and Stephen E. Stein
Quantity | Value | Units | Method | Reference | Comment |
---|---|---|---|---|---|
ΔfH°gas | -91.46 | kJ/mol | Eqk | Rozhnov and Nesterova, 1973 |

Condensed phase thermochemistry data

Data compiled by: Hussein Y. Afeefy, Joel F. Liebman, and Stephen E. Stein
Quantity | Value | Units | Method | Reference | Comment |
---|---|---|---|---|---|
ΔfH°liquid | -135.7 | kJ/mol | Eqk | Rozhnov and Nesterova, 1973 |

Phase change data

Data compiled as indicated in comments:
BS - Robert L. Brown and Stephen E. Stein
ALS - Hussein Y. Afeefy, Joel F. Liebman, and Stephen E. Stein
Quantity | Value | Units | Method | Reference | Comment |
---|---|---|---|---|---|
Tboil | 417.7 | K | N/A | Weast and Grasselli, 1989 | BS |
Quantity | Value | Units | Method | Reference | Comment |
ΔvapH° | 44.27 | kJ/mol | E | Rozhnov and Nesterova, 1973 | ALS |

Reaction thermochemistry data

Data compiled by: Hussein Y. Afeefy, Joel F. Liebman, and Stephen E. Stein
Individual Reactions
By formula: C4H8Br2 = C4H8Br2
Quantity | Value | Units | Method | Reference | Comment |
---|---|---|---|---|---|
ΔrH° | -13. ± 0.8 | kJ/mol | Eqk | Nesterova, Rozhnov, et al., 1973 | gas phase |

References

Rozhnov and Nesterova, 1973
Rozhnov, A.M.; Nesterova, T.N.,
Heats of formation of dibromo-n-butanes,
Russ. J. Phys. Chem. (Engl. Transl.), 1973, 47, 1390, In original 2455. [all data]
Weast and Grasselli, 1989
CRC Handbook of Data on Organic Compounds, 2nd Editon, Weast,R.C and Grasselli, J.G., ed(s)., CRC Press, Inc., Boca Raton, FL, 1989, 1. [all data]
Nesterova, Rozhnov, et al., 1973
Nesterova, T.N.; Rozhnov, A.M.; Borodenko, N.A.,
Equilibrium of 2,2- and 2,3-dibromobutane isomerization,
Izv. Vyssh. Uchebn. Zaved., Khim. Khim. Tekhnol., 1973, 16, 1216-1218. [all data]