Benzoic acid, 2,3,6-trichloro-
- Formula: C7H3Cl3O2
- Molecular weight: 225.457
- IUPAC Standard InChIKey: XZIDTOHMJBOSOX-UHFFFAOYSA-N
- CAS Registry Number: 50-31-7
- Chemical structure:
View 3d structure (requires JavaScript / HTML 5) - Other names: Benzac 1,281; HC 1281; T-2; Trysben; TCB; 2,3,6-Trichlorobenzoic acid; 2,3,6-TBA; 2,3,6-TCBA; Acide trichlorobenzoique; Benzabar; Benzac-1281; Benzak; Fen-all; Kyselina 2,3,6-trichlorbenzoova; NCI-C60242; 2,3,6-Tba(the herbicide); 2,3,6-TCB; TCBA; Tribac; 2,3,6-Trichlorbenzoesaeure; Trichlorobenzoic acid; Trisben

Phase change data

Data compiled as indicated in comments:
TRC - Thermodynamics Research Center, NIST Boulder Laboratories, Chris Muzny director
AC - William E. Acree, Jr., James S. Chickos
Quantity | Value | Units | Method | Reference | Comment |
---|---|---|---|---|---|
Tfus | 402.7 | K | N/A | Plato, 1972 | Uncertainty assigned by TRC = 0.2 K; TRC |
Enthalpy of fusion
ΔfusH (kJ/mol) | Temperature (K) | Reference | Comment |
---|---|---|---|
23.85 | 402.7 | Acree, 1991 | AC |

References

Plato, 1972
Plato, C.,
DSC as a general method for determining purity and heat of fusion of high-purity organic chemicals,
Anal. Chem., 1972, 44, 1531. [all data]
Acree, 1991
Acree, William E.,
Thermodynamic properties of organic compounds: enthalpy of fusion and melting point temperature compilation,
Thermochimica Acta, 1991, 189, 1, 37-56, https://doi.org/10.1016/0040-6031(91)87098-H
. [all data]