3,5-Dimethyl-1H-pyrrole-2,4-dicarboxylic acid 4-methyl ester

Condensed phase thermochemistry data

Data compiled by: Hussein Y. Afeefy, Joel F. Liebman, and Stephen E. Stein

Quantity Value Units Method Reference Comment
Δcsolid-4271.9 ± 4.2kJ/molCcbStern and Klebs, 1933Reanalyzed by Cox and Pilcher, 1970, Original value = -4281.9 kJ/mol; Heat of combustion at 288 K

References

Stern and Klebs, 1933
Stern, A.; Klebs, G., Calorimetrische Bestimmungen bei einfachen und mehrkernigen Pyrrolderivaten, Ann., 1933, 504, 287-297. [all data]

Cox and Pilcher, 1970
Cox, J.D.; Pilcher, G., Thermochemistry of Organic and Organometallic Compounds, Academic Press, New York, 1970, 1-636. [all data]