1,3,5,8-Undecatetraene

Normal alkane RI, polar column, temperature ramp

Data compiled by: NIST Mass Spectrometry Data Center, William E. Wallace, director

Column type CapillaryCapillaryCapillary
Active phase Supelcowax-10DB-WaxDB-Wax
Column length (m) 30.60.60.
Carrier gas  HeHe
Substrate
Column diameter (mm) 0.250.320.32
Phase thickness (μm) 0.250.250.25
Tstart (C) 40.30.30.
Tend (C) 210.180.180.
Heat rate (K/min) 2.2.2.
Initial hold (min) 2.4.4.
Final hold (min) 33.
I 1469.1440.1454.
ReferenceGarneau F.X., Collin G., et al., 2006Takeoka and Butter, 1989Takeoka and Butter, 1989
Comment MSDC-RI MSDC-RI MSDC-RI

References

Garneau F.X., Collin G., et al., 2006
Garneau F.X.; Collin G.; Gagnon H.; Jean F.I.; Strobl H.; Pichette A., The essential oil composition of Devil's Club, Oplopanax horridus J. E. Smith Miq., Flavour Fragr. J., 2006, 21, 5, 792-794, https://doi.org/10.1002/ffj.1716 . [all data]

Takeoka and Butter, 1989
Takeoka, G.; Butter, R.G., Volatile constituents of pineapple (Ananas Comosus [L.] Merr.) in Flavor Chemistry. Trends and Developments, Teranishi,R.; Buttery,R.G.; Shahidi,F., ed(s)., American Chemical Society, Washington, DC, 1989, 223-237. [all data]