2,6-Piperidinedione, 3-(1-hydroxyethyl)-3-phenyl-
- Formula: C13H15NO3
- Molecular weight: 233.2631
- IUPAC Standard InChIKey: XHMCNOHNFNMYFS-UHFFFAOYSA-N
- CAS Registry Number: 50275-57-5
- Chemical structure:
View 3d structure (requires JavaScript / HTML 5) - Other names: 2-(1-Hydroxyethyl)-2-phenylglutarimide; Glutethimide M (OH-ethyl)

Kovats' RI, non-polar column, temperature ramp

Column type | Active phase | I | Reference | Comment |
---|---|---|---|---|
Packed | SE-30 | 2060. | Maurer, 1990 | N2, 100. C @ 3. min, 30. K/min, 310. C @ 5. min |

References

Maurer, 1990
Maurer, H.H.,
Identification and differentiation of barbiturates, other sedative-hypnotics and their metabolites in urine integrated in a general screening procedure using computerized gas chromatography-mass spectrometry,
J. Chromatogr., 1990, 530, 307-326, https://doi.org/10.1016/S0378-4347(00)82334-8
. [all data]