p-Propionoxybenzaldehyde
- Formula: C10H10O3
- Molecular weight: 178.1846
- IUPAC Standard InChIKey: NKXPJXVTMWLHBC-UHFFFAOYSA-N
- CAS Registry Number: 50262-48-1
- Chemical structure:
View 3d structure (requires JavaScript / HTML 5) - Other names: 4-n-Propionyloxybenzaldehyde; Benzaldehyde, 4-(1-oxopropoxy)-

Phase change data

Data compiled by: Robert L. Brown and Stephen E. Stein
Reduced pressure boiling point
Tboil (K) | Pressure (bar) | Reference |
---|---|---|
404. to 409. | 0.0007 | Frinton Laboratories Inc., 1986 |

References

Frinton Laboratories Inc., 1986
Frinton Laboratories Inc.,
Catalog Number 11, Frinton Laboratories Inc., Vineland, NJ, 1986, 99. [all data]