p-Nonyloxybenzaldehyde
- Formula: C16H24O2
- Molecular weight: 248.3606
- IUPAC Standard InChIKey: OZWJLGGZWZZBKK-UHFFFAOYSA-N
- CAS Registry Number: 50262-46-9
- Chemical structure:
View 3d structure (requires JavaScript / HTML 5) - Other names: 4-n-Nonyloxybenzaldehyde

Phase change data

Data compiled by: Robert L. Brown and Stephen E. Stein
Reduced pressure boiling point
Tboil (K) | Pressure (bar) | Reference |
---|---|---|
454. | 0.005 | Frinton Laboratories Inc., 1986 |

References

Frinton Laboratories Inc., 1986
Frinton Laboratories Inc.,
Catalog Number 11, Frinton Laboratories Inc., Vineland, NJ, 1986, 99. [all data]