2-Oxepanone
- Formula: C6H10O2
- Molecular weight: 114.1424
- IUPAC Standard InChIKey: PAPBSGBWRJIAAV-UHFFFAOYSA-N
- CAS Registry Number: 502-44-3
- Chemical structure:
View 3d structure (requires JavaScript / HTML 5) - Other names: ε-Caprolactone; Caprolactone; Hexamethylene oxide, 2-oxo-; Hexanoic acid, 6-hydroxy-, ε-lactone; 1,6-Hexanolide; 6-Hexanolactone; 6-Hydroxyhexanoic acid lactone; 2-Oxacycloheptanone; 6-Caprolactone; Hexanoic acid, ε-lactone; ε-Kaprolakton; Placcel M; Hexanoic acid, 6-hydroxy-, lactone; ε-Caprolactone monomer; 1-Oxa-2-oxocycloheptane; 6-Caprolactone monomer; 6-Hexanalactone; 6-Hexanolide; 6-Hydroxyhexan-6-olide; Hexan-6-olide; Epsilon-caprolactone; E-caprolactone

Gas phase thermochemistry data

Data compiled by: Hussein Y. Afeefy, Joel F. Liebman, and Stephen E. Stein
Quantity | Value | Units | Method | Reference | Comment |
---|---|---|---|---|---|
ΔfH°gas | -94.7 ± 0.6 | kcal/mol | Cm | Wiberg and Waldron, 1991 | Heat of reduction |

Condensed phase thermochemistry data

Data compiled as indicated in comments:
ALS - Hussein Y. Afeefy, Joel F. Liebman, and Stephen E. Stein
DH - Eugene S. Domalski and Elizabeth D. Hearing
Quantity | Value | Units | Method | Reference | Comment |
---|---|---|---|---|---|
ΔfH°liquid | -109.5 ± 0.5 | kcal/mol | Cm | Wiberg and Waldron, 1991 | Heat of reduction; ALS |
Quantity | Value | Units | Method | Reference | Comment |
S°liquid | 56.33 | cal/mol*K | N/A | Lebedev and Yevstropov, 1983 | DH |
S°liquid | 56.31 | cal/mol*K | N/A | Lebedev, Yevstropov, et al., 1978 | DH |
Constant pressure heat capacity of liquid
Cp,liquid (cal/mol*K) | Temperature (K) | Reference | Comment |
---|---|---|---|
47.04 | 298.15 | Lebedev and Yevstropov, 1983 | T = 13.8 to 340 K.; DH |
47.04 | 298.15 | Lebedev, Yevstropov, et al., 1978 | T = 13.8 to 350 K.; DH |

Phase change data

Data compiled as indicated in comments:
BS - Robert L. Brown and Stephen E. Stein
TRC - Thermodynamics Research Center, NIST Boulder Laboratories, Chris Muzny director
ALS - Hussein Y. Afeefy, Joel F. Liebman, and Stephen E. Stein
DRB - Donald R. Burgess, Jr.
AC - William E. Acree, Jr., James S. Chickos
DH - Eugene S. Domalski and Elizabeth D. Hearing
Quantity | Value | Units | Method | Reference | Comment |
---|---|---|---|---|---|
Ttriple | 272.13 | K | N/A | Lebedev and Yevstropov, 1983, 2 | Uncertainty assigned by TRC = 0.02 K; TRC |
Ttriple | 271.83 | K | N/A | Lebedev, Evstropov, et al., 1978 | Uncertainty assigned by TRC = 0.02 K; TRC |
Quantity | Value | Units | Method | Reference | Comment |
ΔvapH° | 14.8 ± 0.3 | kcal/mol | V | Wiberg and Waldron, 1991 | Heat of reduction; ALS |
ΔvapH° | 14.8 | kcal/mol | N/A | Wiberg and Waldron, 1991 | DRB |
ΔvapH° | 14.8 ± 0.31 | kcal/mol | EB | Wiberg and Waldron, 1991 | Based on data from 395. to 436. K.; AC |
Reduced pressure boiling point
Tboil (K) | Pressure (atm) | Reference | Comment |
---|---|---|---|
370.2 | 0.020 | Aldrich Chemical Company Inc., 1990 | BS |
Enthalpy of vaporization
ΔvapH (kcal/mol) | Temperature (K) | Method | Reference | Comment |
---|---|---|---|---|
12.9 ± 0.05 | 415. | EB | Wiberg and Waldron, 1991 | Based on data from 395. to 436. K.; AC |
Enthalpy of fusion
ΔfusH (kcal/mol) | Temperature (K) | Reference | Comment |
---|---|---|---|
3.3031 | 272.13 | Lebedev and Yevstropov, 1983 | DH |
3.3031 | 271.83 | Lebedev, Yevstropov, et al., 1978 | DH |
3.303 | 272. | Acree, 1991 | AC |
Entropy of fusion
ΔfusS (cal/mol*K) | Temperature (K) | Reference | Comment |
---|---|---|---|
12.2 | 272.13 | Lebedev and Yevstropov, 1983 | DH |
12.2 | 271.83 | Lebedev, Yevstropov, et al., 1978 | DH |

Reaction thermochemistry data

Data compiled by: Hussein Y. Afeefy, Joel F. Liebman, and Stephen E. Stein
Individual Reactions
By formula: C6H12O3 = C6H10O2 + H2O
Quantity | Value | Units | Method | Reference | Comment |
---|---|---|---|---|---|
ΔrH° | 3.71 ± 0.07 | kcal/mol | Cm | Wiberg and Waldron, 1991 | solid phase |

References

Wiberg and Waldron, 1991
Wiberg, K.B.; Waldron, R.F.,
Lactones. 2. Enthalpies of hydrolysis, reduction, and formation of the C4-C13 monocyclic lactones. strain energies and conformations,
J. Am. Chem. Soc., 1991, 113, 7697-7705. [all data]
Lebedev and Yevstropov, 1983
Lebedev, B.V.; Yevstropov, A.A.,
Thermodynamics of β-propiolactone, t-butyrolactone, d-valerolactone, and e-caprolactone from 13.8 to 340 K,
J. Chem. Thermodynam., 1983, 15, 115-128. [all data]
Lebedev, Yevstropov, et al., 1978
Lebedev, B.V.; Yevstropov, A.A.; Lebedev, N.K.; Karpova, Ye.A.; Lyudvig, Ye.B.; Belen'kaya, B.G.,
The thermodynamics of e-caprolactone, its polymer and of e-caprolactone polymerization in the 0-350°K range,
Vysokomol. Soedin., 1978, A20, 1974-1980. [all data]
Lebedev and Yevstropov, 1983, 2
Lebedev, B.V.; Yevstropov, A.A. (see evstro aa),
Thermodynamics of β-propiolactone, γ-butyrolactone, δ- valerolactone, and ε-caprolactone from 13.8 to 340 K,
J. Chem. Thermodyn., 1983, 15, 115. [all data]
Lebedev, Evstropov, et al., 1978
Lebedev, B.V.; Evstropov, A.A.; Lebedev, N.K.; Belov, V.I.,
The thermodynamics of ε-caprolactone, its polymer and of η-caprolactam polymerization in the 0-350 K range,
Vysikomol. Soedin., Ser. A, 1978, 20, 1974-80. [all data]
Aldrich Chemical Company Inc., 1990
Aldrich Chemical Company Inc.,
Catalog Handbook of Fine Chemicals, Aldrich Chemical Company, Inc., Milwaukee WI, 1990, 1. [all data]
Acree, 1991
Acree, William E.,
Thermodynamic properties of organic compounds: enthalpy of fusion and melting point temperature compilation,
Thermochimica Acta, 1991, 189, 1, 37-56, https://doi.org/10.1016/0040-6031(91)87098-H
. [all data]