Hydrocortisone
- Formula: C21H30O5
- Molecular weight: 362.4599
- IUPAC Standard InChIKey: JYGXADMDTFJGBT-NDNUHCHRSA-N
- CAS Registry Number: 50-23-7
- Chemical structure:
View 3d structure (requires JavaScript / HTML 5) - Stereoisomers:
- Other names: Hydroxycortisone; Pregn-4-ene-3,20-dione, 11,17,21-trihydroxy-, (11β)-; Cortisol; anti-Inflammatory hormone; Cobadex; Cort-Dome; Cortanal; Cortef; Cortenema; Corticreme; Cortifan; Cortiment; Cortispray; Cortonema; Cortril; Dihydrocostisone; Domolene-HC; Efcorbin; Epiderm H; Esiderm H; Ficortril; Genacort; Heb-Cort; Hidro-Colisona; Hycort; Hycortol; Hycortole; Hydrasson; Hydro-Adreson; Hydrocorticosterone; Hydrocortisone alcohol; Hydrocortisyl; Hydrocortone; Hytone lotion; HC; Incortin-H; Kendall's Compound F; NSC 10483; Optef; Otosone-F; Permicort; Polcort H; Reichstein's Substance M; Scheroson F; Signef; Tarcortin; Texacort lotion 25; Topicort; Traumaide; 11β-Hydroxycortisone; 17α-Hydroxycorticosterone; 17-Hydroxycorticosterone; 4-Pregnen-11β,17α,21-triol-3,20-dione; Aeroseb HC; Ala-Scalp; Alacort; Barseb HC; Cetacort; Cleiton; Compound F; Compound F (kendall); Cortisol alcohol; Cortolotion; Cortoxide; Cremesone; Delacort; Dermacort; Dermolate; Efcortelan; Efcortelin; Eldecort; Eldercort; Epicort; Fiocortril; H-Cort; Hydro-colisona; Hydrocortisone free alcohol; Hydrocortistab; Hytone; Incortin-hydrogen; Komed HC; Maintasone; Pregn-4-ene-3,20-dione, 11β,17,21-trihydroxy-; Proctocort; Rectoid; 11β-Hydrocortisone; 11β,17α,21-Trihydroxy-4-pregnene-3,20-dione; 11β,17α,21-Trihydroxypregn-4-ene-3,20-dione; 11β,17,21-Trihydroxypregn-4-ene-3,20-dione; 4-Pregnene-11β,17α,21-triol-3,20-dione; Acticort; CaldeCort Spray; Lacticare-HC; Nutracort; Penecort; 11,17,21-Trihydroxypregn-4-ene-3,20-dione, (11β)-; 11β,17,21-trihydroxyprogesterone; Dioderm; Anflam; Dermocortal; Zenoxone; U 1851; Medicort; Mildison; 11Beta,17,21-trihydroxy progesterone; Cor-Tar-Quin (Salt/Mix); Cort-Quin (Salt/Mix); Cortisporin (Salt/Mix); Drotic (Salt/Mix); Neo-Cort-Dome (Salt/Mix); Nystaform-HC (Salt/Mix); Otalgine (Salt/Mix); Otic-Neo-Cort-Dome (Salt/Mix); Otobiotic (Salt/Mix); Otocort (Salt/Mix); Pediotic Suspension (Salt/Mix); Racet (Salt/Mix); Vioform-Hydrocortisone (Salt/Mix); VoSol HC (Salt/Mix); Vytone (Salt/Mix); Alphaderm (Salt/Mix)

Condensed phase thermochemistry data

Data compiled by: Hussein Y. Afeefy, Joel F. Liebman, and Stephen E. Stein
Quantity | Value | Units | Method | Reference | Comment |
---|---|---|---|---|---|
ΔcH°solid | -2744. ± 8. | kcal/mol | Ccb | Paoli, Garrigues, et al., 1969 | Corresponding ΔfHºsolid = -256. kcal/mol (simple calculation by NIST; no Washburn corrections) |

Phase change data

Data compiled by: William E. Acree, Jr., James S. Chickos
Enthalpy of fusion
ΔfusH (kcal/mol) | Temperature (K) | Reference |
---|---|---|
8.566 | 486. | Regosz, Chmielewska, et al., 1994 |

References

Paoli, Garrigues, et al., 1969
Paoli, D.; Garrigues, J.-C.; Patin, H.,
Combustion microcalorimetry: application to steroids,
C. R. Acad. Sci. Paris, 1969, 268, 780-783. [all data]
Regosz, Chmielewska, et al., 1994
Regosz, A.; Chmielewska, A.; Pelplinska, T.; Kowalski, P.,
Prediction of the solubility of steroid hormones,
Pharmazie, 1994, 49, 5, 371. [all data]