Corticosterone

Phase change data

Data compiled by: William E. Acree, Jr., James S. Chickos

Enthalpy of fusion

ΔfusH (kJ/mol) Temperature (K) Method Reference
35.3458.5DSCWassvik, Holmén, et al., 2008
33.32454.N/ARegosz, Chmielewska, et al., 1994

References

Wassvik, Holmén, et al., 2008
Wassvik, Carola M.; Holmén, Anders G.; Draheim, Rieke; Artursson, Per; Bergström, Christel A.S., Molecular Characteristics for Solid-State Limited Solubility, J. Med. Chem., 2008, 51, 10, 3035-3039, https://doi.org/10.1021/jm701587d . [all data]

Regosz, Chmielewska, et al., 1994
Regosz, A.; Chmielewska, A.; Pelplinska, T.; Kowalski, P., Prediction of the solubility of steroid hormones, Pharmazie, 1994, 49, 5, 371. [all data]