Bicyclo[3.2.1]octan-2-one
- Formula: C8H12O
- Molecular weight: 124.1803
- IUPAC Standard InChIKey: SXFPXZSENHPCSH-UHFFFAOYSA-N
- CAS Registry Number: 5019-82-9
- Chemical structure:
View 3d structure (requires JavaScript / HTML 5) - Other names: Bicyclo[3,2,1]octan-2-one

Gas phase thermochemistry data

Data compiled by: Hussein Y. Afeefy, Joel F. Liebman, and Stephen E. Stein
Quantity | Value | Units | Method | Reference | Comment |
---|---|---|---|---|---|
ΔfH°gas | -218. ± 8.4 | kJ/mol | Ccb | Steele, 1979 |

References

Steele, 1979
Steele, W.V.,
Thermochemically determined ΔH°f(g) values for ketones and alcohols,
Private Communication, University of Stirling, Stirling, Scotland, 1979, 0. [all data]