Benzenepropanoic acid, 4-hydroxy-
- Formula: C9H10O3
- Molecular weight: 166.1739
- IUPAC Standard InChIKey: NMHMNPHRMNGLLB-UHFFFAOYSA-N
- CAS Registry Number: 501-97-3
- Chemical structure:
View 3d structure (requires JavaScript / HTML 5) - Other names: Phloretic acid; Hydrocinnamic acid, p-hydroxy-; β-(p-Hydroxyphenyl)propionic acid; p-Hydroxyhydrocinnamic acid; p-Hydroxyphenylpropionic acid; Hydro-p-coumaric acid; 3-(p-Hydroxyphenyl)propionic acid; 3-(4-Hydroxyphenyl)propanoic acid; 3-(4-Hydroxyphenyl)propionic acid; 4-Hydroxyphenylpropionic acid; 3-(para-Hydroxyphenyl)-propionic acid; Dihydro-p-coumaric acid; 4-Hydroxybenzenepropanoic acid; 3-(4'-Hydroxyphenyl)propionic acid; 4-(2-Carboxyethyl)phenol; NSC 40949

Phase change data

Data compiled by: Thermodynamics Research Center, NIST Boulder Laboratories, Chris Muzny director
Quantity | Value | Units | Method | Reference | Comment |
---|---|---|---|---|---|
Tfus | 402.5 | K | N/A | Armstrong, James, et al., 1979 | Uncertainty assigned by TRC = 0.5 K |

Van Den Dool and Kratz RI, non-polar column, custom temperature program

Column type | Active phase | I | Reference | Comment |
---|---|---|---|---|
Capillary | VF-5MS | 1653.6 | Tret'yakov, 2008 | 30. m/0.25 mm/0.25 μm, He; Program: Multi-step temperature program; T(initial)=60C; T(final)=270C |

References

Armstrong, James, et al., 1979
Armstrong, N.A.; James, K.C.; Wong, C.K.,
Inter-relationships between solubilities, distribution coefficients and melting points of some substituted benzoic and phenylacetic acids,
J. Pharm. Pharmacol., 1979, 31, 1, 627, https://doi.org/10.1111/j.2042-7158.1979.tb13606.x
. [all data]
Tret'yakov, 2008
Tret'yakov, K.V.,
Retention Data. NIST Mass Spectrometry Data Center., NIST Mass Spectrometry Data Center, 2008. [all data]