Phenol, 3,5-dimethoxy-
- Formula: C8H10O3
- Molecular weight: 154.1632
- IUPAC Standard InChIKey: XQDNFAMOIPNVES-UHFFFAOYSA-N
- CAS Registry Number: 500-99-2
- Chemical structure:
View 3d structure (requires JavaScript / HTML 5) - Other names: Phloroglucinol dimethyl ether; Taxicatigenin; 1-Hydroxy-3,5-dimethoxybenzene; 3,5-Dimethoxyphenol

Phase change data

Data compiled as indicated in comments:
BS - Robert L. Brown and Stephen E. Stein
AC - William E. Acree, Jr., James S. Chickos
Quantity | Value | Units | Method | Reference | Comment |
---|---|---|---|---|---|
ΔsubH° | 101.1 ± 2.3 | kJ/mol | C | Matos, Miranda, et al., 2003 | AC |
Reduced pressure boiling point
Tboil (K) | Pressure (bar) | Reference | Comment |
---|---|---|---|
446.7 | 0.023 | Weast and Grasselli, 1989 | BS |

Van Den Dool and Kratz RI, non-polar column, temperature ramp

Column type | Active phase | I | Reference | Comment |
---|---|---|---|---|
Capillary | HP-101 | 1531. | Milos and Radonic, 2000 | 25. m/0.2 mm/0.2 μm, He, 70. C @ 2. min, 3. K/min, 200. C @ 10. min |

Van Den Dool and Kratz RI, polar column, temperature ramp

Column type | Active phase | I | Reference | Comment |
---|---|---|---|---|
Capillary | DB-Wax | 2848. | Wirth, Guo, et al., 2001 | 30. m/0.32 mm/0.5 μm, He, 60. C @ 3. min, 3. K/min, 245. C @ 20. min |

Normal alkane RI, non-polar column, custom temperature program

Column type | Active phase | I | Reference | Comment |
---|---|---|---|---|
Capillary | DB-5 | 1472. | Jean, Garneau, et al., 1993 | Column length: 30. m; Column diameter: 0.25 mm; Program: not specified |

Normal alkane RI, polar column, custom temperature program

Column type | Active phase | I | Reference | Comment |
---|---|---|---|---|
Capillary | Supelcowax-10 | 2858. | Jean, Garneau, et al., 1993 | Column length: 30. m; Column diameter: 0.25 mm; Program: not specified |

References

Matos, Miranda, et al., 2003
Matos, M. Agostinha R.; Miranda, Margarida S.; Morais, Victor M.F.,
Thermochemical Study of the Methoxy- and Dimethoxyphenol Isomers,
J. Chem. Eng. Data, 2003, 48, 3, 669-679, https://doi.org/10.1021/je025641j
. [all data]
Weast and Grasselli, 1989
CRC Handbook of Data on Organic Compounds, 2nd Editon, Weast,R.C and Grasselli, J.G., ed(s)., CRC Press, Inc., Boca Raton, FL, 1989, 1. [all data]
Milos and Radonic, 2000
Milos, M.; Radonic, A.,
Gas chromatography mass spectral analysis of free and glycosidically bound volatile compounds from Juniperus oxycedrus L. growing wild in Croatia,
Food Chem., 2000, 68, 3, 333-338, https://doi.org/10.1016/S0308-8146(99)00192-2
. [all data]
Wirth, Guo, et al., 2001
Wirth, J.; Guo, W.; Baumes, R.; Günata, Z.,
Volatile compounds released by enzymatic hydrolysis of glycoconjugates of leaves and grape berries from Vitis vinifera muscat of Alexandria and Shiraz cultivars,
J. Agric. Food Chem., 2001, 49, 6, 2917-2923, https://doi.org/10.1021/jf001398l
. [all data]
Jean, Garneau, et al., 1993
Jean, F.-I.; Garneau, F.-X.; Collin, G.J.; Bouhajib, M.; Zamir, L.O.,
The essential oil and glycosidically bound volatile compounds of Taxus canadensis marsh,
J. Essent. Oil Res., 1993, 5, 1, 7-11, https://doi.org/10.1080/10412905.1993.9698163
. [all data]