Butane, 2-(ethylthio)-
- Formula: C6H14S
- Molecular weight: 118.240
- IUPAC Standard InChIKey: JFNGZXUPUVUYST-UHFFFAOYSA-N
- CAS Registry Number: 5008-72-0
- Chemical structure:
View 3d structure (requires JavaScript / HTML 5) - Other names: Sulfide, sec-butyl ethyl; sec-Butyl ethyl sulfide; 4-Methyl-3-thiahexane; (1-Methylpropyl) ethyl sulfide; 2-(Ethylthio)butane; Ethyl (1-methylpropyl) sulfide; Ethyl 2-butyl sulfide

Phase change data

Data compiled as indicated in comments:
TRC - Thermodynamics Research Center, NIST Boulder Laboratories, Chris Muzny director
AC - William E. Acree, Jr., James S. Chickos
Quantity | Value | Units | Method | Reference | Comment |
---|---|---|---|---|---|
Tboil | 406.8 | K | N/A | Mcallan, Cullum, et al., 1951 | Uncertainty assigned by TRC = 0.4 K; TRC |
Enthalpy of vaporization
ΔvapH (kJ/mol) | Temperature (K) | Method | Reference | Comment |
---|---|---|---|---|
41.2 | 319. | N/A | Dykyj, Svoboda, et al., 1999 | Based on data from 304. to 434. K.; AC |
39.0 | 360. | A,EB | Stephenson and Malanowski, 1987 | Based on data from 345. to 409. K. See also White, Barnard--Smith, et al., 1952.; AC |

References

Mcallan, Cullum, et al., 1951
Mcallan, D.T.; Cullum, T.V.; Dean, R.A.; Fidler, F.A.,
The Preparation and Properties of Sulfur Compounds Related to Petroleum I. The Dialkyl Sulfides and Disulfides,
J. Am. Chem. Soc., 1951, 73, 3627-32. [all data]
Dykyj, Svoboda, et al., 1999
Dykyj, J.; Svoboda, J.; Wilhoit, R.C.; Frenkel, M.L.; Hall, K.R.,
Vapor Pressure of Chemicals: Part A. Vapor Pressure and Antoine Constants for Hydrocarbons and Sulfur, Selenium, Tellurium and Hydrogen Containing Organic Compounds, Springer, Berlin, 1999, 373. [all data]
Stephenson and Malanowski, 1987
Stephenson, Richard M.; Malanowski, Stanislaw,
Handbook of the Thermodynamics of Organic Compounds, 1987, https://doi.org/10.1007/978-94-009-3173-2
. [all data]
White, Barnard--Smith, et al., 1952
White, P.T.; Barnard--Smith, D.G.; Fidler, F.A.,
Vapor Pressure--Temperature Relationships of Sulfur Compounds Related to Petroleum,
Ind. Eng. Chem., 1952, 44, 6, 1430-1438, https://doi.org/10.1021/ie50510a064
. [all data]