5-Heptylresorcinol
- Formula: C13H20O2
- Molecular weight: 208.2967
- IUPAC Standard InChIKey: QENPJKGENOZEEJ-UHFFFAOYSA-N
- CAS Registry Number: 500-67-4
- Chemical structure:
View 3d structure (requires JavaScript / HTML 5) - Other names: 1,3-Benzenediol, 5-heptyl-

Phase change data

Data compiled as indicated in comments:
BS - Robert L. Brown and Stephen E. Stein
AC - William E. Acree, Jr., James S. Chickos
Reduced pressure boiling point
Tboil (K) | Pressure (bar) | Reference | Comment |
---|---|---|---|
490. | 0.019 | Frinton Laboratories Inc., 1986 | BS |
Enthalpy of vaporization
ΔvapH (kJ/mol) | Temperature (K) | Method | Reference | Comment |
---|---|---|---|---|
91.6 | 458. | A,GC | Stephenson and Malanowski, 1987 | Based on data from 443. to 504. K. See also Kundel, Lille, et al., 1975.; AC |

References

Frinton Laboratories Inc., 1986
Frinton Laboratories Inc.,
Catalog Number 11, Frinton Laboratories Inc., Vineland, NJ, 1986, 99. [all data]
Stephenson and Malanowski, 1987
Stephenson, Richard M.; Malanowski, Stanislaw,
Handbook of the Thermodynamics of Organic Compounds, 1987, https://doi.org/10.1007/978-94-009-3173-2
. [all data]
Kundel, Lille, et al., 1975
Kundel, H.; Lille, U.; Kaidas, N.,
Tr. Tallin. Politekh. Inst., 1975, 390, 107. [all data]