Phenobarbital
- Formula: C12H12N2O3
- Molecular weight: 232.2353
- IUPAC Standard InChIKey: DDBREPKUVSBGFI-UHFFFAOYSA-N
- CAS Registry Number: 50-06-6
- Chemical structure:
View 3d structure (requires JavaScript / HTML 5) - Other names: 2,4,6(1H,3H,5H)-Pyrimidinetrione, 5-ethyl-5-phenyl-; Barbituric acid, 5-ethyl-5-phenyl-; Adonal; Agrypnal; Amylofene; Barbenyl; Barbiphenyl; Barbipil; Barbita; Barbivis; Blu-phen; Cratecil; Dormiral; Doscalun; Duneryl; Eskabarb; Etilfen; Euneryl; Fenemal; Gardenal; Gardepanyl; Hysteps; Lepinal; Lepinaletten; Liquital; Lixophen; Lubergal; Luminal; Neurobarb; Noptil; Nunol; Phenaemal; Phenemal; Phenobarbitone; Phenobarbituric acid; Phenoluric; Phenonyl; Phenylethylbarbituric acid; Phenylethylmalonylurea; Phenyral; Phob; Sedonal; Sevenal; Somonal; Stental Extentabs; Teolaxin; Triphenatol; Versomnal; 5-Ethyl-5-phenylbarbituric acid; 5-Phenyl-5-ethylbarbituric acid; Aephenal; Aphenylbarbit; Aphenyletten; Barbilehae (barbilettae); Barbinal; Barbiphen; Barbonal; Barbophen; Bardorm; Bartol; Bialminal; Cabronal; Calmetten; Calminal; Cardenal; Chinoin; Codibarbita; Coronaletta; Damoral; Dezibarbitur; Dormina; Ensobarb; Ensodorm; Epanal; Epidorm; Epilol; Episedal; Epsylone; Fenbital; Fenobarbital; Fenosed; Fenylettae; Glysoletten; Haplopan; Haplos; Helional; Hennoletten; Henotal; Hypnaletten; Hypnette; Hypno-Tablinetten; Hypnogen; Hypnolone; Hypnoltol; Lefebar; Leonal; Lephebar; Linasen; Lubrokal; Lumen; Lumesettes; Lumesyn; Lumofridetten; Luphenil; Luramin; Molinal; Nirvonal; Nova-Pheno; Parkotal; Pharmetten; Phen-Bar; Phenemalum; Phenobal; Phenobarbitol; Phenobarbyl; Phenolurio; Phenomet; Phenoturic; Phenylethylbarbiturate; Phenyletten; Polcominal; Promptonal; Seda-Tablinen; Sedabar; Sedicat; Sedizorin; Sedlyn; Sedofen; Sedonettes; Solfoton; Solu-Barb; Sombutol; Somnolens; Somnoletten; Somnosan; Spasepilin; Starifen; Starilettae; Stental; Talpheno; Teoloxin; Thenobarbital; Theoloxin; Triabarb; Tridezibarbitur; Zadoletten; Zadonal; 5-Ethyl-5-phenyl-2,4,6(1H,3H,5H)-pyrimidinetrione; Mephobarbital M (nor); Methylphenobarbital, M(nor-); Fenemal recip; Phenobar; Sedophen; Sedonal (sedative); component of Antrocol; component of Bronkotabs; component of Hecadrol; component of Hydantal; component of Primatene P; component of Slowten; component of Tedral; component of Valpin 50-PB; Dormital; SK-Phenobarbital; Sinoratox; component of Barbidonna; component of Chardonna-2; component of Donnatal; component of Donnazyme; component of Kinesed; component of Levsin pb drops and tablets; component of Quadrinal; Solfoton talpheno; Primidone, M (phenobarbital); Antrocol (Salt/Mix); Barbidonna (Salt/Mix); Bronkotabs (Salt/Mix); Chardonna-2 (Salt/Mix); Donnatal (Salt/Mix); Donnazyme (Salt/Mix); Hydantal (Salt/Mix); Kinesed (Salt/Mix); Quadrinal (Salt/Mix); Tedral (Salt/Mix); Levsin PB Drops and Tablets (Salt/Mix); component of Primatene P (Salt/Mix); component of Valpin 50-PB (Salt/Mix)

Phase change data

Data compiled by: Thermodynamics Research Center, NIST Boulder Laboratories, Chris Muzny director
Quantity | Value | Units | Method | Reference | Comment |
---|---|---|---|---|---|
Tfus | 449. | K | N/A | Kuffner, Bush, et al., 1957 | Uncertainty assigned by TRC = 4. K; not clear that this was measured by author |

Kovats' RI, non-polar column, isothermal

View large format table.

Column type Active phase Temperature (C) I Reference Comment
CapillaryDB-5220.1984.Phillips, Logan, et al., 199015. m/0.25 mm/0.2 μm, He
CapillaryBP-1200.1932.Japp, Gill, et al., 198725. m/0.22 mm/0.25 μm, N2
CapillaryDB-1200.1931.Japp, Gill, et al., 198730. m/0.53 mm/1.5 μm, N2
CapillaryBP-1200.1937.Japp, Gill, et al., 198725. m/0.53 mm/1. μm, N2
CapillarySPB-1250.1995.Lora-Tamayo, Rams, et al., 1986He; Column length: 25. m; Column diameter: 0.20 mm
PackedSE-30200.1934.Stead, Gill, et al., 1982
PackedOV-1200.1955.Berninger and Möller, 1977
PackedOV-101200.1950.Möller, 1976N2, Chromosorb G AW DMCS (80-100 mesh); Column length: 2. m
PackedOV-101200.1955.Möller, 1976N2, Chromosorb G AW DMCS (80-100 mesh); Column length: 2. m
PackedOV-101200.1955.Möller, 1976N2, Chromosorb G AW DMCS (80-100 mesh); Column length: 2. m
PackedOV-101200.1960.Möller, 1976N2, Chromosorb G AW DMCS (80-100 mesh); Column length: 2. m

Kovats' RI, non-polar column, temperature ramp

View large format table.

Column type Active phase I Reference Comment
PackedSE-301965.Maurer, 1990N2, 100. C @ 3. min, 30. K/min, 310. C @ 5. min
PackedSE-301965.Maurer, 1990N2, 100. C @ 3. min, 30. K/min, 310. C @ 5. min
PackedOV-1011965.Maurer, 1990, 2N2, Chromosorb G HP, 100. C @ 3. min, 30. K/min, 310. C @ 5. min; Column length: 0.6 m
PackedOV-1011965.Maurer, 1990, 2N2, Chromosorb G HP, 100. C @ 3. min, 30. K/min, 310. C @ 5. min; Column length: 0.6 m
PackedOV-1011965.Maurer, 1990, 2N2, Chromosorb G HP, 100. C @ 3. min, 30. K/min, 310. C @ 5. min; Column length: 0.6 m
CapillarySE-301939.Schepers, Wijsbeek, et al., 198212. m/0.22 mm/0.45 μm, He, 120. C @ 2. min, 8. K/min, 300. C @ 12. min
CapillarySE-301938.Schepers, Wijsbeek, et al., 198225. m/0.49 mm/1.14 μm, 100. C @ 2. min, 8. K/min, 275. C @ 15. min

Kovats' RI, non-polar column, custom temperature program

View large format table.

Column type Active phase I Reference Comment
PackedOV-1011990.McLinden and Stenhouse, 1979N2, Chromosorb W; Column length: 2. m; Program: not specified
PackedOV-11975.Berninger, Grunnagel, et al., 1975N2, Chromosorb G, AW-DMCS; Column length: 2. m; Program: not specified
PackedOV-11970.Berninger, Grunnagel, et al., 1975N2, Chromosorb G, AW-DMCS; Column length: 2. m; Program: not specified

Van Den Dool and Kratz RI, non-polar column, temperature ramp

View large format table.

Column type Active phase I Reference Comment
CapillarySPB-11944.Christ, Noomano, et al., 198830. m/0.75 mm/1.0 μm, He, 10. K/min, 280. C @ 12. min; Tstart: 160. C
CapillaryDB-11928.Perrigo, Peel, et al., 198515. m/0.32 mm/0.25 μm, He, 8. K/min, 280. C @ 5. min; Tstart: 120. C
CapillaryMethyl Silicone1921.5Newton and Foery, 198412. m/0.2 mm/0.33 μm, He, 50. C @ 1. min, 20. K/min, 300. C @ 3. min
Capillary5 % Phenyl methyl siloxane1995.0Newton and Foery, 198412. m/0.2 mm/0.33 μm, He, 50. C @ 1. min, 20. K/min, 300. C @ 3. min
CapillaryDB-11928.Perrigo, Ballantyne, et al., 198415. m/0.25 mm/0.25 μm, He, 8. K/min, 280. C @ 5. min; Tstart: 120. C
PackedSE-301975.Perrigo and Peel, 1981N2, Chromosorb W, 130. C @ 2. min, 8. K/min, 290. C @ 8. min; Column length: 1.8 m

Van Den Dool and Kratz RI, non-polar column, custom temperature program

View large format table.

Column type Active phase I Reference Comment
CapillaryBP-11924.Stowell and Wilson, 198712. m/0.22 mm/0.25 μm, He; Program: 120C => 8C/min => 270C => 25C/min => 300C

Normal alkane RI, non-polar column, isothermal

View large format table.

Column type Active phase Temperature (C) I Reference Comment
PackedOV-101180.1964.Dubsky, Hána, et al., 1978Nitrogen, Chromosorb G (100-120 mesh); Column length: 2. m
PackedOV-101200.1950.Dubsky, Hána, et al., 1978Nitrogen, Chromosorb G (100-120 mesh); Column length: 2. m
PackedOV-101200.1955.Dubsky, Hána, et al., 1978Nitrogen, Chromosorb G (100-120 mesh); Column length: 2. m
PackedOV-101200.1950.Möller, 1976N2, Chromosorb G AW DMCS (80-100 mesh); Column length: 2. m

Normal alkane RI, non-polar column, temperature ramp

View large format table.

Column type Active phase I Reference Comment
CapillaryBP-11934.MHA, 9999Tstart: 100. C; Tend: 300. C
CapillarySE-541996.Friel, Logan, et al., 199730. m/0.32 mm/0.25 μm, He, 80. C @ 1. min, 15. K/min, 295. C @ 8. min
CapillaryOV-11957.Schutz and Wollrab A., 198816. K/min; Tstart: 200. C; Tend: 280. C
CapillaryDB-11926.Sharp, 198715. m/0.25 mm/0.25 μm, He, 130. C @ 1. min, 10. K/min, 290. C @ 10. min
CapillaryBP-11928.Stowell and Wilson, 198512. m/0.22 mm/0.25 μm, He, 8. K/min; Tstart: 120. C; Tend: 280. C
CapillaryBP-11922.Stowell and Wilson, 198512. m/0.22 mm/0.25 μm, He, 20. K/min; Tstart: 50. C; Tend: 300. C
PackedSE-301935.Marozzi, Gambaro, et al., 1982Gas Chrom P, 2.5 K/min; Column length: 2. m; Tstart: 120. C; Tend: 200. C
PackedSE-301975.Peel and Perrigo, 1976Nitrogen, Chromosorb W AW DMS (80-100 mesh), 130. C @ 2. min, 8. K/min, 290. C @ 8. min; Column length: 2. m
PackedSE-301975.Peel and Perrigo, 1975N2, Chromosorb W AW DMS, 130. C @ 2. min, 8. K/min, 290. C @ 8. min; Column length: 2. m

Normal alkane RI, non-polar column, custom temperature program

View large format table.

Column type Active phase I Reference Comment
CapillaryCP Sil 5 CB1980.Bogusz, Bialka, et al., 198610. m/0.53 mm/5.2 μm; Program: 100 0C (2 min) 20 0C/min -> 180 0C 7.5 0C/min -> 280 0C (6 min)
CapillaryCP Sil 5 CB1957.Bogusz, Bialka, et al., 198610. m/0.53 mm/5.2 μm; Program: not specified
CapillaryBP-11924.Stowell and Wilson, 198512. m/0.22 mm/0.25 μm, He; Program: 120 0X 8 0C/min -> 270 0C 25 0C/min -> 300 0C (5 min)
CapillaryBP-11950.Stowell and Wilson, 198512. m/0.22 mm/0.25 μm, He; Program: not specified
OtherMethyl Silicone1957.Ardrey and Moffat, 1981Program: not specified
PackedOV-1011954.Dubsky, Hána, et al., 1978Nitrogen, Chromosorb G (100-120 mesh); Column length: 2. m; Program: not specified
PackedOV-1011950.Dubsky, Hána, et al., 1978Nitrogen, Chromosorb G (100-120 mesh); Column length: 2. m; Program: not specified

References

Kuffner, Bush, et al., 1957
Kuffner, R.J.; Bush, M.T.; Bircher, L.J.,
Studies on the surface tension of aqueous barbituric acid solutions,
J. Am. Chem. Soc., 1957, 79, 1587-1589. [all data]