Cyclobutanecarboxylic acid chloride
- Formula: C5H7ClO
- Molecular weight: 118.561
- IUPAC Standard InChIKey: JFWMYCVMQSLLOO-UHFFFAOYSA-N
- CAS Registry Number: 5006-22-4
- Chemical structure:
View 3d structure (requires JavaScript / HTML 5) - Other names: Cyclobutanecarbonyl chloride; Cyclobutane carboxyl chloride

Phase change data

Data compiled by: Robert L. Brown and Stephen E. Stein
Quantity | Value | Units | Method | Reference | Comment |
---|---|---|---|---|---|
Tboil | 406. to 412. | K | N/A | Frinton Laboratories Inc., 1986 |
Reduced pressure boiling point
Tboil (K) | Pressure (bar) | Reference |
---|---|---|
333.2 | 0.067 | Weast and Grasselli, 1989 |

References

Frinton Laboratories Inc., 1986
Frinton Laboratories Inc.,
Catalog Number 11, Frinton Laboratories Inc., Vineland, NJ, 1986, 99. [all data]
Weast and Grasselli, 1989
CRC Handbook of Data on Organic Compounds, 2nd Editon, Weast,R.C and Grasselli, J.G., ed(s)., CRC Press, Inc., Boca Raton, FL, 1989, 1. [all data]