2-Bromo-2,2-difluoro-N,N-bis(trifluoromethyl)ethylamine

Phase change data

Data compiled by: William E. Acree, Jr., James S. Chickos

Enthalpy of vaporization

ΔvapH (kJ/mol) Temperature (K) Method Reference Comment
33.6328.AStephenson and Malanowski, 1987Based on data from 313. - 348. K. See also Haszeldine and Tipping, 1965.

References

Stephenson and Malanowski, 1987
Stephenson, Richard M.; Malanowski, Stanislaw, Handbook of the Thermodynamics of Organic Compounds, 1987, https://doi.org/10.1007/978-94-009-3173-2 . [all data]

Haszeldine and Tipping, 1965
Haszeldine, R.N.; Tipping, A.E., 1145. Perfluoroalkyl derivatives of nitrogen. Part XVII. The reaction of N-bromobistrifluoromethylamine with olefins, J. Chem. Soc., 1965, 6141, https://doi.org/10.1039/jr9650006141 . [all data]