3-Pyridinecarboxaldehyde
- Formula: C6H5NO
- Molecular weight: 107.1100
- IUPAC Standard InChIKey: QJZUKDFHGGYHMC-UHFFFAOYSA-N
- CAS Registry Number: 500-22-1
- Chemical structure:
View 3d structure (requires JavaScript / HTML 5) - Other names: Nicotinaldehyde; β-Pyridinecarbonaldehyde; Nicotinealdehyde; Nicotinic aldehyde; Rowalind; 3-Formylpyridine; 3-Pyridinaldehyde; 3-Pyridinealdehyde; 3-Pyridylaldehyde; 3-Pyridylcarboxaldehyde; 3-Nicotinaldehyde; Pyridine-3-carboxaldehyde; Pyridine-3-aldehyde; 3-Pyridinecarbaldehyde; Pyridine-3-carbaldehyde; NSC 8952

Phase change data

Data compiled by: Robert L. Brown and Stephen E. Stein
Reduced pressure boiling point
Tboil (K) | Pressure (bar) | Reference |
---|---|---|
369.2 | 0.020 | Aldrich Chemical Company Inc., 1990 |

Normal alkane RI, non-polar column, custom temperature program

Column type | Active phase | I | Reference | Comment |
---|---|---|---|---|
Capillary | CP Sil 5 CB | 968. | Guyot, Scheirman, et al., 1999 | He; Column length: 50. m; Column diameter: 0.32 mm; Program: 30C => 55C/min => 85C => 1C/min => 145C => 3C/min => 250C |
Capillary | CP Sil 5 CB | 968. | Guyot, Bouseta, et al., 1998 | 50. m/0.32 mm/1.2 μm, He; Program: 30C => 55C/min => 85C => 1C/min => 145C => 3C/min => 250C |

References

Aldrich Chemical Company Inc., 1990
Aldrich Chemical Company Inc.,
Catalog Handbook of Fine Chemicals, Aldrich Chemical Company, Inc., Milwaukee WI, 1990, 1. [all data]
Laviron, 1961
Laviron, E.,
Plarographie et etude physico-chimique des derives carbonyles et halogenes de la pyridine et de bases heterocycliques I,
Bull. Soc. Chim. Fr., 1961, 2325-2349. [all data]
Guyot, Scheirman, et al., 1999
Guyot, C.; Scheirman, V.; Collin, S.,
Floral origin markers of heather honeys: Calluna vulgaris and Erica arborea,
Food Chem., 1999, 64, 1, 3-11, https://doi.org/10.1016/S0308-8146(98)00122-8
. [all data]
Guyot, Bouseta, et al., 1998
Guyot, C.; Bouseta, A.; Scheirman, V.; Collin, S.,
Floral origin markers of chestnut and lime tree honeys,
J. Agric. Food Chem., 1998, 46, 2, 625-633, https://doi.org/10.1021/jf970510l
. [all data]