2,2-dichloro-4,4-dimethylpentane
- Formula: C7H14Cl2
- Molecular weight: 169.092
- IUPAC Standard InChIKey: LNQACOKWYOUDJP-UHFFFAOYSA-N
- CAS Registry Number: 500060-49-1
- Chemical structure:
View 3d structure (requires JavaScript / HTML 5) - Species with the same structure:

Phase change data

Data compiled by: Thermodynamics Research Center, NIST Boulder Laboratories, Chris Muzny director
Quantity | Value | Units | Method | Reference | Comment |
---|---|---|---|---|---|
Tboil | 434. | K | N/A | Schmerling, 1946 | Uncertainty assigned by TRC = 3. K |
Quantity | Value | Units | Method | Reference | Comment |
Tfus | 239. | K | N/A | Schmerling, 1946 | Uncertainty assigned by TRC = 3. K |

References

Schmerling, 1946
Schmerling, L.,
Condensation of Saturated Halides with Unsaturated Compounds II. The Condensation of ALkyl Halides with Monohaloolefins,
J. Am. Chem. Soc., 1946, 68, 1650-4. [all data]