1,1,3,4-tetramethylcyclohexane

Phase change data

Data compiled by: Thermodynamics Research Center, NIST Boulder Laboratories, Chris Muzny director

Quantity Value Units Method Reference Comment
Tboil433.0KN/AChiurdoglu and Maquestiau, 1954Uncertainty assigned by TRC = 2. K

In addition to the Thermodynamics Research Center (TRC) data available from this site, much more physical and chemical property data is available from the following TRC products:

References

Chiurdoglu and Maquestiau, 1954
Chiurdoglu, G.; Maquestiau, A., Alicyclic Compounds with a Quaternary Carbon I. Syntheses of Some gem-Polymethylcyclohexanes, Bull. Soc. Chim. Belg., 1954, 63, 357. [all data]