(±)-3-methyl-1-(1-methylethenyl)cyclohexene
- Formula: C10H26
- Molecular weight: 146.3134
- IUPAC Standard InChIKey: UCHKLBIBXHPXJL-UHFFFAOYSA-N
- CAS Registry Number: 500032-37-1
- Chemical structure:
View 3d structure (requires JavaScript / HTML 5) - Species with the same structure:

Phase change data

Data compiled by: Thermodynamics Research Center, NIST Boulder Laboratories, Chris Muzny director
Quantity | Value | Units | Method | Reference | Comment |
---|---|---|---|---|---|
Tboil | 455. | K | N/A | Luff and Perkin, 1910 | Uncertainty assigned by TRC = 4. K |

References

Luff and Perkin, 1910
Luff, B.; Perkin, W.H.,
J. Chem. Soc., 1910, 97, 2154. [all data]