cis-1,3,5-trimethylcyclopentene
- Formula: C8H16
- Molecular weight: 112.2126
- IUPAC Standard InChIKey: OWPJONKQLQZFEP-HTRCEHHLSA-N
- CAS Registry Number: 500031-65-2
- Chemical structure:
View 3d structure (requires JavaScript / HTML 5) - Species with the same structure:
- Stereoisomers:

Phase change data

Data compiled by: Thermodynamics Research Center, NIST Boulder Laboratories, Chris Muzny director
Quantity | Value | Units | Method | Reference | Comment |
---|---|---|---|---|---|
Tboil | 384.37 | K | N/A | Slomp, 1951 | Uncertainty assigned by TRC = 0.3 K |

References

Slomp, 1951
Slomp, G.,
, Ph.D. Thesis, Ohio State Univ., Columbus, OH, 1951. [all data]