3-methoxy-1-butene
- Formula: C5H10O
- Molecular weight: 86.1323
- IUPAC Standard InChIKey: MALHZSOXIOUUQH-UHFFFAOYSA-N
- CAS Registry Number: 500028-75-1
- Chemical structure:
View 3d structure (requires JavaScript / HTML 5) - Species with the same structure:

Phase change data

Data compiled by: Thermodynamics Research Center, NIST Boulder Laboratories, Chris Muzny director
Quantity | Value | Units | Method | Reference | Comment |
---|---|---|---|---|---|
Tboil | 327. | K | N/A | Wiberg, 1952 | Uncertainty assigned by TRC = 4. K |

References

Wiberg, 1952
Wiberg, K.B.,
J. Am. Chem. Soc., 1952, 74, 3891. [all data]