(1-methyltridecyl)cyclohexane
- Formula: C20H40
- Molecular weight: 280.5316
- IUPAC Standard InChIKey: PAVHCWTZPFZEEM-UHFFFAOYSA-N
- CAS Registry Number: 500028-24-0
- Chemical structure:
View 3d structure (requires JavaScript / HTML 5) - Permanent link for this species. Use this link for bookmarking this species for future reference.

Phase change data

Data compiled by: Thermodynamics Research Center, NIST Boulder Laboratories, Chris Muzny director
Quantity | Value | Units | Method | Reference | Comment |
---|---|---|---|---|---|
Tfus | 254. | K | N/A | Petrov and Chel'tsova, 1942 | Uncertainty assigned by TRC = 3. K |
Tfus | 254. | K | N/A | Petrov, 1941 | Uncertainty assigned by TRC = 3. K |

References

Petrov and Chel'tsova, 1942
Petrov, A.D.; Chel'tsova, M.A.,
Synthesis and Properties of Hydrocarbons of the Aromatic and Naphthenic Series of the Composition C19-C26. II.,
J. Gen. Chem. USSR (Engl. Transl.), 1942, 12, 87-94. [all data]
Petrov, 1941
Petrov, A.D.,
Izv. Akad. Nauk SSSR, 1941, 1941, 533. [all data]