3-methyl-2,4,6-heptatriene
- Formula: C8H12
- Molecular weight: 108.1809
- IUPAC Standard InChIKey: HBOBXPNYRYGOCI-ZCOYIIAOSA-N
- CAS Registry Number: 500027-36-1
- Chemical structure:
View 3d structure (requires JavaScript / HTML 5) - Species with the same structure:

Phase change data

Data compiled by: Thermodynamics Research Center, NIST Boulder Laboratories, Chris Muzny director
Quantity | Value | Units | Method | Reference | Comment |
---|---|---|---|---|---|
Tfus | 186. | K | N/A | Enklaar, 1917 | Uncertainty assigned by TRC = 8. K |

References

Enklaar, 1917
Enklaar, C.J.,
Recl. Trav. Chim. Pays-Bas, 1917, 36, 215. [all data]