3,4,4,5-tetramethyl-2-hexene (high boil. isomer)

Phase change data

Data compiled by: Thermodynamics Research Center, NIST Boulder Laboratories, Chris Muzny director

Quantity Value Units Method Reference Comment
Tboil433.2KN/AStehman, Cook, et al., 1950Uncertainty assigned by TRC = 1. K
Tboil433.KN/AWhitmore, Ropp, et al., 1950Uncertainty assigned by TRC = 2. K

In addition to the Thermodynamics Research Center (TRC) data available from this site, much more physical and chemical property data is available from the following TRC products:

References

Stehman, Cook, et al., 1950
Stehman, C.J.; Cook, N.C.; Percival, W.C.; Whitmore, F.C., Hydrocarbons: XI synthesis of nineteen decenes, J. Am. Chem. Soc., 1950, 72, 4163-5. [all data]

Whitmore, Ropp, et al., 1950
Whitmore, F.C.; Ropp, W.S.; Cook, N.C., The Dimerization of Triptene with Sulfuric Acid, J. Am. Chem. Soc., 1950, 72, 1507. [all data]