1,4-benzenediol dipropanoate
- Formula: C12H14O4
- Molecular weight: 222.2372
- CAS Registry Number: 500025-90-1

Phase change data

Data compiled by: Thermodynamics Research Center, NIST Boulder Laboratories, Chris Muzny director
Quantity | Value | Units | Method | Reference | Comment |
---|---|---|---|---|---|
Tfus | 386. | K | N/A | Hurd, Perletz, et al., 1945 | Uncertainty assigned by TRC = 2. K |

References

Hurd, Perletz, et al., 1945
Hurd, C.D.; Perletz, P.; Drake, S.S.,
Attempts to Isolate Methylketene by Pyrolytic Methods,
J. Org. Chem., 1945, 10, 62-6. [all data]