(S)-(+)-3-methylpentyl ethanoate
- Formula: C8H16O2
- Molecular weight: 144.2114
- IUPAC Standard InChIKey: NFYJZIICTJCGOR-SSDOTTSWSA-N
- CAS Registry Number: 500025-41-2
- Chemical structure:
View 3d structure (requires JavaScript / HTML 5) - Species with the same structure:
- Stereoisomers:

Phase change data

Data compiled by: Thermodynamics Research Center, NIST Boulder Laboratories, Chris Muzny director
Quantity | Value | Units | Method | Reference | Comment |
---|---|---|---|---|---|
Tboil | 376.4 | K | N/A | Pino, Lardicci, et al., 1959 | Uncertainty assigned by TRC = 1.5 K |

References

Pino, Lardicci, et al., 1959
Pino, P.; Lardicci, L.; Centoni, L.,
Synthesis of (+)(S)-3-methyl-1-pentene,
J. Org. Chem., 1959, 24, 1399-14-3. [all data]