17-methyloctadecanoic acid
- Formula: C19H38O2
- Molecular weight: 298.5038
- IUPAC Standard InChIKey: YETXGSGCWODRAA-UHFFFAOYSA-N
- CAS Registry Number: 500024-93-1
- Chemical structure:
View 3d structure (requires JavaScript / HTML 5) - Permanent link for this species. Use this link for bookmarking this species for future reference.

Phase change data

Data compiled by: Thermodynamics Research Center, NIST Boulder Laboratories, Chris Muzny director
Quantity | Value | Units | Method | Reference | Comment |
---|---|---|---|---|---|
Tfus | 340.7 | K | N/A | Cason, 1942 | Uncertainty assigned by TRC = 1. K |

References

Cason, 1942
Cason, J.,
Branched-Chain Fatty Acids I. Synthesis of 17-Methyloctadecanoic Acid,
J. Am. Chem. Soc., 1942, 64, 1106-10. [all data]