22-methyltritetracontane

Phase change data

Data compiled by: Thermodynamics Research Center, NIST Boulder Laboratories, Chris Muzny director

Quantity Value Units Method Reference Comment
Tfus339.8KN/AMazee, 1948Uncertainty assigned by TRC = 2. K
Tfus339.8KN/ABacker and Strating, 1940Uncertainty assigned by TRC = 2. K

In addition to the Thermodynamics Research Center (TRC) data available from this site, much more physical and chemical property data is available from the following TRC products:

References

Mazee, 1948
Mazee, W.M., Some properties of hydrocarbons having more than twenty carbon atoms, Recl. Trav. Chim. Pays-Bas, 1948, 67, 197-213. [all data]

Backer and Strating, 1940
Backer, H.J.; Strating, J., Synthesis of some aliphatic hydrocarbons crystallized in the pure state: II, Recl. Trav. Chim. Pays-Bas, 1940, 59, 933. [all data]