10-methyloctadecanoic acid

Phase change data

Data compiled by: Thermodynamics Research Center, NIST Boulder Laboratories, Chris Muzny director

Quantity Value Units Method Reference Comment
Tfus296.6KN/AProut, Cason, et al., 1948Uncertainty assigned by TRC = 4. K
Tfus298.9KN/AProut, Cason, et al., 1948Uncertainty assigned by TRC = 2. K

In addition to the Thermodynamics Research Center (TRC) data available from this site, much more physical and chemical property data is available from the following TRC products:

References

Prout, Cason, et al., 1948
Prout, F.S.; Cason, J.; Ingersoll, A.W., J. Am. Chem. Soc., 1948, 70, 298. [all data]