neodynium dipivaloylmethanate

Phase change data

Data compiled by: Thermodynamics Research Center, NIST Boulder Laboratories, Chris Muzny director

Quantity Value Units Method Reference Comment
Tfus492.8KN/AKonstantinov, Dudchik, et al., 1980Uncertainty assigned by TRC = 0.6 K

In addition to the Thermodynamics Research Center (TRC) data available from this site, much more physical and chemical property data is available from the following TRC products:

References

Konstantinov, Dudchik, et al., 1980
Konstantinov, S.G.; Dudchik, G.P.; Korsun, V.P.; Polyachenok, O.G., Saturated vapor pressure and thermodynamics of vaporization of dipivaloylmethanates of some rare earths, Deposited Doc. ONIITEkhim Cherkassy, 1980, Doc. No. 672 khp - 80, 1980. [all data]