2,5-dimethyl-4-octene

Phase change data

Data compiled by: Thermodynamics Research Center, NIST Boulder Laboratories, Chris Muzny director

Quantity Value Units Method Reference Comment
Tboil427.KN/ABjelouss, 1912Uncertainty assigned by TRC = 6. K

In addition to the Thermodynamics Research Center (TRC) data available from this site, much more physical and chemical property data is available from the following TRC products:

References

Bjelouss, 1912
Bjelouss, E., The effect of grignard compounds on methyl ethyl acrolein and the production of some diolefins, olefins and saturated secondary alcohols, Ber. Dtsch. Chem. Ges., 1912, 45, 625. [all data]