pentaethylacetophenone

Phase change data

Data compiled by: Thermodynamics Research Center, NIST Boulder Laboratories, Chris Muzny director

Quantity Value Units Method Reference Comment
Tfus414.KN/AWhite, Biggs, et al., 1940Uncertainty assigned by TRC = 2. K

In addition to the Thermodynamics Research Center (TRC) data available from this site, much more physical and chemical property data is available from the following TRC products:

References

White, Biggs, et al., 1940
White, A.H.; Biggs, B.S.; Morgan, S.O., Dielectric Evidence for Molecular Rotation in the Crystals of Certain Benzene Derivatives, J. Am. Chem. Soc., 1940, 62, 16-25. [all data]