6-butyl-6-ethyltetradecane
- Formula: C20H42
- Molecular weight: 282.5475
- IUPAC Standard InChIKey: ZTYPZXVXDWXOOX-UHFFFAOYSA-N
- CAS Registry Number: 500020-79-1
- Chemical structure:
View 3d structure (requires JavaScript / HTML 5) - Permanent link for this species. Use this link for bookmarking this species for future reference.

Phase change data

Data compiled by: Thermodynamics Research Center, NIST Boulder Laboratories, Chris Muzny director
Quantity | Value | Units | Method | Reference | Comment |
---|---|---|---|---|---|
Tfus | 203. | K | N/A | Rabjohn, 1955 | Uncertainty assigned by TRC = 5. K |

References

Rabjohn, 1955
Rabjohn, N.,
Unpublished, Univ. of Missouri, Columbus, 1955. [all data]