4,5-diethyl-2,7-dimethyloctane
- Formula: C14H30
- Molecular weight: 198.3880
- CAS Registry Number: 500020-62-2

Phase change data

Data compiled by: Thermodynamics Research Center, NIST Boulder Laboratories, Chris Muzny director
Quantity | Value | Units | Method | Reference | Comment |
---|---|---|---|---|---|
Tboil | 489. | K | N/A | Petrov and Kaplan, 1942 | Uncertainty assigned by TRC = 4. K |
Quantity | Value | Units | Method | Reference | Comment |
Tfus | 203. | K | N/A | Petrov and Kaplan, 1942 | Uncertainty assigned by TRC = 5. K |

References

Petrov and Kaplan, 1942
Petrov, A.D.; Kaplan, E.P.,
Zh. Obshch. Khim., 1942, 12, 99. [all data]